libhackshield problema la compilare game

Totalitatea subiectelor care nu respectă regulamentul impus in sectiunea "Probleme şi Întrebări" vor fi stocate aici.
Închis
Avatar utilizator
CjMt2
Nivel 2

Nivel 2
Mesaje: 291
Membru din: 20 Sep 2014, 07:01
Server: CjMt2
Regat: Shinsoo
Aprecieri: 18  
Mulţumiri: 22  
Discord: Copiază ID
 Contact:
Medalii

Update:
Am gasit si am facut:

Cod: Selectaţi tot

cp libanticpxsvr.a /usr/local/lib/libanticpxsvr.a
acum primesc:

Cod: Selectaţi tot

compile minilzo.c
linking ../game....
ld: error: duplicate symbol: MD5_Round
>>> defined at MD5.c
>>>            MD5.o:(MD5_Round) in archive /usr/local/lib/libanticpxsvr.a
>>> defined at MD5.c
>>>            MD5.o:(.text+0x0) in archive /usr/local/lib/libanticpxsvr.a

ld: error: duplicate symbol: E_MD5_Init
>>> defined at MD5.c
>>>            MD5.o:(E_MD5_Init) in archive /usr/local/lib/libanticpxsvr.a
>>> defined at MD5.c
>>>            MD5.o:(.text+0x6D0) in archive /usr/local/lib/libanticpxsvr.a

ld: error: duplicate symbol: E_MD5_Update
>>> defined at MD5.c
>>>            MD5.o:(E_MD5_Update) in archive /usr/local/lib/libanticpxsvr.a
>>> defined at MD5.c
>>>            MD5.o:(.text+0x710) in archive /usr/local/lib/libanticpxsvr.a

ld: error: duplicate symbol: E_MD5_Final
>>> defined at MD5.c
>>>            MD5.o:(E_MD5_Final) in archive /usr/local/lib/libanticpxsvr.a
>>> defined at MD5.c
>>>            MD5.o:(.text+0x810) in archive /usr/local/lib/libanticpxsvr.a

ld: error: duplicate symbol: E_MD5
>>> defined at MD5.c
>>>            MD5.o:(E_MD5) in archive /usr/local/lib/libanticpxsvr.a
>>> defined at MD5.c
>>>            MD5.o:(.text+0x910) in archive /usr/local/lib/libanticpxsvr.a
clang-14: error: linker command failed with exit code 1 (use -v to see invocation)



In masina

Cod: Selectaţi tot

FreeBSD localhost 13.0-RELEASE-p4 FreeBSD 13.0-RELEASE-p4 #0: Tue Aug 24 18:58:48 UTC 2021     [email protected]:/usr/obj/usr/src/i386.i386/sys/GENERIC  i386
http://s.go.ro/tlmgqyt1

am libhackshield/lib

AntiCpXSvr.lib

http://s.go.ro/6a71wupk

si libhackshield/include cu

AntiCpSvrFunc.h
AntiCpXSvr.h
HsCryptLib.h
HShield.h
HSUpChk.h
HsUserUtil.h
HsUserUtilDll.h

http://s.go.ro/b5ncmlj6

Dupa ce rulez comenzile

Cod: Selectaţi tot

cd /usr/home/metin2/src/game/src/OBJDIR && rm -rf *.* && 
cd /usr/home/metin2/src/game/src && gmake dep && gmake clean && gmake -j20 -error-limit=0 default
primesc

Cod: Selectaţi tot

linking ../game....
ld: error: undefined symbol: _AhnHS_CreateServerObject
>>> referenced by HackShield_Impl.cpp:14
>>>               OBJDIR/HackShield_Impl.o:(CHackShieldImpl::Initialize())

ld: error: undefined symbol: _AhnHS_CloseServerHandle
>>> referenced by HackShield_Impl.cpp:28
>>>               OBJDIR/HackShield_Impl.o:(CHackShieldImpl::Release())

ld: error: undefined symbol: _AhnHS_CreateClientObject
>>> referenced by HackShield_Impl.cpp:44
>>>               OBJDIR/HackShield_Impl.o:(CHackShieldImpl::CreateClientHandle(unsigned int))

ld: error: undefined symbol: _AhnHS_CloseClientHandle
>>> referenced by HackShield_Impl.cpp:71
>>>               OBJDIR/HackShield_Impl.o:(CHackShieldImpl::DeleteClientHandle(unsigned int))

ld: error: undefined symbol: _AhnHS_MakeRequest
>>> referenced by HackShield_Impl.cpp:97
>>>               OBJDIR/HackShield_Impl.o:(CHackShieldImpl::SendCheckPacket(CHARACTER*))

ld: error: undefined symbol: _AhnHS_VerifyResponseEx
>>> referenced by HackShield_Impl.cpp:142
>>>               OBJDIR/HackShield_Impl.o:(CHackShieldImpl::VerifyAck(CHARACTER*, SPacketGCHSCheck*))
clang-14: error: linker command failed with exit code 1 (use -v to see invocation)
http://s.go.ro/w9zld6ze
Daca nu era freebsd open source si rain nu ar fi furat filele sursei de la ymir azi nu exista acest forum.
Afișează semnătura
Închis
Răspunsuri
2
Vizualizări
195
Răspunsuri
8
Vizualizări
454
Răspunsuri
5
Vizualizări
499
Răspunsuri
6
Vizualizări
247

Înapoi la “Arhivă Probleme şi Întrebări”

  • Informaţie