Cod: Selectaţi tot
Making all in compat
CC libbsd_compat_la-humanize_number.lo
CC libbsd_compat_la-strtonum.lo
humanize_number.c: In function 'humanize_number':
humanize_number.c:176: error: expected ')' before 'PRId64'
humanize_number.c:178: warning: spurious trailing '%' in format
humanize_number.c:178: warning: spurious trailing '%' in format
*** [libbsd_compat_la-humanize_number.lo] Error code 1
1 error
*** [all-recursive] Error code 1
1 error
*** [all] Error code 2
1 error
===> Compilation failed unexpectedly.
Try to set MAKE_JOBS_UNSAFE=yes and rebuild before reporting the failure to
the maintainer.
*** [do-build] Error code 1
Stop in /usr/ports/ports-mgmt/pkg.
*** [/usr/ports/ports-mgmt/pkg/work/.build_done.pkg._usr_local] Error code 1
Stop in /usr/ports/ports-mgmt/pkg.
root@host:/usr/ports/ports-mgmt/pkg #




