Problema compilare Launcher

Totalitatea subiectelor care nu respectă regulamentul impus in sectiunea "Probleme şi Întrebări" vor fi stocate aici.
Închis
Avatar utilizator
HolyAngels
Nivel 2

Nivel 2
Mesaje: 154
Membru din: 11 Mai 2015, 16:10
Server: Metin2ROT
Regat: Jinno
Aprecieri: 215  
Mulţumiri: 5  
 Contact:
Medalii

*Problemă: Eroare Compilare Launcher
Tipologie server: Pro-Metin2
*Resursă folosită: Sursa Pro-Metin2
*ServerFiles utilizat Pro-Metin2:
*Syserr:
8> c:\users\andrei-alina\desktop\incl+lib\include_stuff\cryptopp\pubkey.h(995) : see reference to class template instantiation 'CryptoPP::DL_SignatureSchemeBase<CryptoPP::PK_Signer,CryptoPP::DL_PrivateKey<CryptoPP::Integer>>' being compiled
8> c:\users\andrei-alina\desktop\incl+lib\include_stuff\cryptopp\simple.h(25) : see reference to class template instantiation 'CryptoPP::DL_SignerBase<CryptoPP::Integer>' being compiled
8> c:\users\andrei-alina\desktop\incl+lib\include_stuff\cryptopp\pubkey.h(1282) : see reference to class template instantiation 'CryptoPP::AlgorithmImpl<BASE,CryptoPP::DSA>' being compiled
8> with
8> [
8> BASE=CryptoPP::DL_SignerBase<CryptoPP::Integer>
8> ]
8> c:\users\andrei-alina\desktop\incl+lib\include_stuff\cryptopp\pubkey.h(1317) : see reference to class template instantiation 'CryptoPP::DL_ObjectImplBase<BASE,SCHEME_OPTIONS,KEY>' being compiled
8> with
8> [
8> BASE=CryptoPP::DL_SignerBase<CryptoPP::Integer>
8> , SCHEME_OPTIONS=CryptoPP::DL_SignatureSchemeOptions<CryptoPP::DSA,CryptoPP::DL_Keys_DSA,CryptoPP::DL_Algorithm_GDSA<CryptoPP::Integer>,CryptoPP::DL_SignatureMessageEncodingMethod_DSA,CryptoPP::SHA>
8> , KEY=CryptoPP::DL_PrivateKey_WithSignaturePairwiseConsistencyTest<CryptoPP::DL_PrivateKey_GFP<CryptoPP::DL_GroupParameters_DSA>,CryptoPP::DSA>
8> ]
8> c:\users\andrei-alina\desktop\incl+lib\include_stuff\cryptopp\pubkey.h(1339) : see reference to class template instantiation 'CryptoPP::DL_ObjectImpl<CryptoPP::DL_SignerBase<CryptoPP::Integer>,SCHEME_OPTIONS,CryptoPP::DL_PrivateKey_WithSignaturePairwiseConsistencyTest<CryptoPP::DL_PrivateKey_GFP<CryptoPP::DL_GroupParameters_DSA>,CryptoPP::DSA>>' being compiled
8> with
8> [
8> SCHEME_OPTIONS=CryptoPP::DL_SignatureSchemeOptions<CryptoPP::DSA,CryptoPP::DL_Keys_DSA,CryptoPP::DL_Algorithm_GDSA<CryptoPP::Integer>,CryptoPP::DL_SignatureMessageEncodingMethod_DSA,CryptoPP::SHA>
8> ]
8> c:\users\andrei-alina\desktop\incl+lib\include_stuff\cryptopp\pubkey.h(1489) : see reference to class template instantiation 'CryptoPP::DL_SignerImpl<CryptoPP::DL_SignatureSchemeOptions<ALG_INFO,KEYS,SA,MEM,H>>' being compiled
8> with
8> [
8> ALG_INFO=CryptoPP::DSA
8> , KEYS=CryptoPP::DL_Keys_DSA
8> , SA=CryptoPP::DL_Algorithm_GDSA<CryptoPP::Integer>
8> , MEM=CryptoPP::DL_SignatureMessageEncodingMethod_DSA
8> , H=CryptoPP::SHA
8> ]
8> c:\users\andrei-alina\desktop\incl+lib\include_stuff\cryptopp\pubkey.h(830) : see reference to class template instantiation 'CryptoPP::PK_FinalTemplate<CryptoPP::DL_SignerImpl<CryptoPP::DL_SignatureSchemeOptions<ALG_INFO,KEYS,SA,MEM,H>>>' being compiled
8> with
8> [
8> ALG_INFO=CryptoPP::DSA
8> , KEYS=CryptoPP::DL_Keys_DSA
8> , SA=CryptoPP::DL_Algorithm_GDSA<CryptoPP::Integer>
8> , MEM=CryptoPP::DL_SignatureMessageEncodingMethod_DSA
8> , H=CryptoPP::SHA
8> ]
8> c:\users\andrei-alina\desktop\incl+lib\include_stuff\cryptopp\pubkey.h(825) : while compiling class template member function 'void CryptoPP::DL_PrivateKey_WithSignaturePairwiseConsistencyTest<CryptoPP::DL_PrivateKey_GFP<CryptoPP::DL_GroupParameters_DSA>,CryptoPP::DSA>::GenerateRandom(CryptoPP::RandomNumberGenerator &,const CryptoPP::NameValuePairs &)'
8> c:\users\andrei-alina\desktop\incl+lib\include_stuff\cryptopp\gfpcrypt.h(416) : see reference to class template instantiation 'CryptoPP::DL_PrivateKey_WithSignaturePairwiseConsistencyTest<CryptoPP::DL_PrivateKey_GFP<CryptoPP::DL_GroupParameters_DSA>,CryptoPP::DSA>' being compiled
8>c:\users\andrei-alina\desktop\incl+lib\include_stuff\cryptopp\pubkey.h(1086): warning C4100: 'signatureLength' : unreferenced formal parameter
8> c:\users\andrei-alina\desktop\incl+lib\include_stuff\cryptopp\pubkey.h(1087) : while compiling class template member function 'void CryptoPP::DL_VerifierBase<CryptoPP::Integer>::InputSignature(CryptoPP::PK_MessageAccumulator &,const byte *,size_t) const'
8> c:\users\andrei-alina\desktop\incl+lib\include_stuff\cryptopp\simple.h(25) : see reference to class template instantiation 'CryptoPP::DL_VerifierBase<CryptoPP::Integer>' being compiled
8> c:\users\andrei-alina\desktop\incl+lib\include_stuff\cryptopp\pubkey.h(1282) : see reference to class template instantiation 'CryptoPP::AlgorithmImpl<BASE,CryptoPP::DSA>' being compiled
8> with
8> [
8> BASE=CryptoPP::DL_VerifierBase<CryptoPP::Integer>
8> ]
8> c:\users\andrei-alina\desktop\incl+lib\include_stuff\cryptopp\pubkey.h(1317) : see reference to class template instantiation 'CryptoPP::DL_ObjectImplBase<BASE,SCHEME_OPTIONS,KEY>' being compiled
8> with
8> [
8> BASE=CryptoPP::DL_VerifierBase<CryptoPP::Integer>
8> , SCHEME_OPTIONS=CryptoPP::DL_SignatureSchemeOptions<CryptoPP::DSA,CryptoPP::DL_Keys_DSA,CryptoPP::DL_Algorithm_GDSA<CryptoPP::Integer>,CryptoPP::DL_SignatureMessageEncodingMethod_DSA,CryptoPP::SHA>
8> , KEY=CryptoPP::DL_PublicKey_GFP<CryptoPP::DL_GroupParameters_DSA>
8> ]
8> c:\users\andrei-alina\desktop\incl+lib\include_stuff\cryptopp\pubkey.h(1352) : see reference to class template instantiation 'CryptoPP::DL_ObjectImpl<CryptoPP::DL_VerifierBase<CryptoPP::Integer>,SCHEME_OPTIONS,CryptoPP::DL_PublicKey_GFP<CryptoPP::DL_GroupParameters_DSA>>' being compiled
8> with
8> [
8> SCHEME_OPTIONS=CryptoPP::DL_SignatureSchemeOptions<CryptoPP::DSA,CryptoPP::DL_Keys_DSA,CryptoPP::DL_Algorithm_GDSA<CryptoPP::Integer>,CryptoPP::DL_SignatureMessageEncodingMethod_DSA,CryptoPP::SHA>
8> ]
8> c:\users\andrei-alina\desktop\incl+lib\include_stuff\cryptopp\pubkey.h(1489) : see reference to class template instantiation 'CryptoPP::DL_VerifierImpl<CryptoPP::DL_SignatureSchemeOptions<ALG_INFO,KEYS,SA,MEM,H>>' being compiled
8> with
8> [
8> ALG_INFO=CryptoPP::DSA
8> , KEYS=CryptoPP::DL_Keys_DSA
8> , SA=CryptoPP::DL_Algorithm_GDSA<CryptoPP::Integer>
8> , MEM=CryptoPP::DL_SignatureMessageEncodingMethod_DSA
8> , H=CryptoPP::SHA
8> ]
8> c:\users\andrei-alina\desktop\incl+lib\include_stuff\cryptopp\pubkey.h(831) : see reference to class template instantiation 'CryptoPP::PK_FinalTemplate<CryptoPP::DL_VerifierImpl<CryptoPP::DL_SignatureSchemeOptions<ALG_INFO,KEYS,SA,MEM,H>>>' being compiled
8> with
8> [
8> ALG_INFO=CryptoPP::DSA
8> , KEYS=CryptoPP::DL_Keys_DSA
8> , SA=CryptoPP::DL_Algorithm_GDSA<CryptoPP::Integer>
8> , MEM=CryptoPP::DL_SignatureMessageEncodingMethod_DSA
8> , H=CryptoPP::SHA
8> ]
8>c:\users\andrei-alina\desktop\incl+lib\include_stuff\cryptopp\secblock.h(149): warning C4100: 'n' : unreferenced formal parameter
8> c:\users\andrei-alina\desktop\incl+lib\include_stuff\cryptopp\secblock.h(150) : while compiling class template member function 'void CryptoPP::NullAllocator<T>::deallocate(void *,CryptoPP::NullAllocator<T>::size_type)'
8> with
8> [
8> T=byte
8> ]
8> c:\users\andrei-alina\desktop\incl+lib\include_stuff\cryptopp\secblock.h(202) : see reference to function template instantiation 'void CryptoPP::NullAllocator<T>::deallocate(void *,CryptoPP::NullAllocator<T>::size_type)' being compiled
8> with
8> [
8> T=byte
8> ]
8> c:\users\andrei-alina\desktop\incl+lib\include_stuff\cryptopp\secblock.h(232) : see reference to class template instantiation 'CryptoPP::NullAllocator<T>' being compiled
8> with
8> [
8> T=byte
8> ]
8> c:\users\andrei-alina\desktop\incl+lib\include_stuff\cryptopp\secblock.h(241) : see reference to class template instantiation 'CryptoPP::FixedSizeAllocatorWithCleanup<T,32,CryptoPP::NullAllocator<T>,false>' being compiled
8> with
8> [
8> T=byte
8> ]
8> c:\users\andrei-alina\desktop\incl+lib\include_stuff\cryptopp\secblock.h(423) : see reference to class template instantiation 'CryptoPP::SecBlock<T,A>' being compiled
8> with
8> [
8> T=byte
8> , A=CryptoPP::FixedSizeAllocatorWithCleanup<byte,32,CryptoPP::NullAllocator<byte>,false>
8> ]
8> c:\users\andrei-alina\desktop\incl+lib\include_stuff\cryptopp\randpool.h(25) : see reference to class template instantiation 'CryptoPP::FixedSizeSecBlock<byte,32,CryptoPP::FixedSizeAllocatorWithCleanup<T,32,CryptoPP::NullAllocator<T>,false>>' being compiled
8> with
8> [
8> T=byte
8> ]
8>c:\users\andrei-alina\desktop\incl+lib\include_stuff\cryptopp\secblock.h(149): warning C4100: 'p' : unreferenced formal parameter
8>c:\users\andrei-alina\desktop\incl+lib\include_stuff\cryptopp\pubkey.h(1065): warning C4100: 'ma' : unreferenced formal parameter
8> c:\users\andrei-alina\desktop\incl+lib\include_stuff\cryptopp\pubkey.h(1066) : while compiling class template member function 'void CryptoPP::DL_SignerBase<CryptoPP::Integer>::RestartMessageAccumulator(CryptoPP::RandomNumberGenerator &,CryptoPP::PK_MessageAccumulatorBase &) const'
8> c:\users\andrei-alina\desktop\incl+lib\include_stuff\cryptopp\pubkey.h(1344) : see reference to function template instantiation 'void CryptoPP::DL_SignerBase<CryptoPP::Integer>::RestartMessageAccumulator(CryptoPP::RandomNumberGenerator &,CryptoPP::PK_MessageAccumulatorBase &) const' being compiled
8>c:\users\andrei-alina\desktop\incl+lib\include_stuff\cryptopp\pubkey.h(1065): warning C4100: 'rng' : unreferenced formal parameter
8>c:\users\andrei-alina\desktop\incl+lib\include_stuff\cryptopp\secblock.h(143): warning C4100: 'n' : unreferenced formal parameter
8> c:\users\andrei-alina\desktop\incl+lib\include_stuff\cryptopp\secblock.h(144) : while compiling class template member function 'unsigned int *CryptoPP::NullAllocator<T>::allocate(CryptoPP::NullAllocator<T>::size_type,const void *)'
8> with
8> [
8> T=CryptoPP::word32
8> ]
8> c:\users\andrei-alina\desktop\incl+lib\include_stuff\cryptopp\secblock.h(189) : see reference to function template instantiation 'unsigned int *CryptoPP::NullAllocator<T>::allocate(CryptoPP::NullAllocator<T>::size_type,const void *)' being compiled
8> with
8> [
8> T=CryptoPP::word32
8> ]
8> c:\users\andrei-alina\desktop\incl+lib\include_stuff\cryptopp\secblock.h(232) : see reference to class template instantiation 'CryptoPP::NullAllocator<T>' being compiled
8> with
8> [
8> T=CryptoPP::word32
8> ]
8> c:\users\andrei-alina\desktop\incl+lib\include_stuff\cryptopp\secblock.h(241) : see reference to class template instantiation 'CryptoPP::FixedSizeAllocatorWithCleanup<T,60,CryptoPP::NullAllocator<T>,true>' being compiled
8> with
8> [
8> T=CryptoPP::word32
8> ]
8> c:\users\andrei-alina\desktop\incl+lib\include_stuff\cryptopp\secblock.h(423) : see reference to class template instantiation 'CryptoPP::SecBlock<T,A>' being compiled
8> with
8> [
8> T=CryptoPP::word32
8> , A=CryptoPP::FixedSizeAllocatorWithCleanup<CryptoPP::word32,60,CryptoPP::NullAllocator<CryptoPP::word32>,true>
8> ]
8> c:\users\andrei-alina\desktop\incl+lib\include_stuff\cryptopp\secblock.h(430) : see reference to class template instantiation 'CryptoPP::FixedSizeSecBlock<T,60,CryptoPP::FixedSizeAllocatorWithCleanup<T,60,CryptoPP::NullAllocator<T>,true>>' being compiled
8> with
8> [
8> T=CryptoPP::word32
8> ]
8> c:\users\andrei-alina\desktop\incl+lib\include_stuff\cryptopp\rijndael.h(37) : see reference to class template instantiation 'CryptoPP::FixedSizeAlignedSecBlock<CryptoPP::word32,60,true>' being compiled
8>c:\users\andrei-alina\desktop\incl+lib\include_stuff\cryptopp\algparam.h(155): warning C4100: 'dummy' : unreferenced formal parameter
8> c:\users\andrei-alina\desktop\incl+lib\include_stuff\cryptopp\gfpcrypt.h(129) : see reference to function template instantiation 'CryptoPP::GetValueHelperClass<CryptoPP::DL_GroupParameters_GFP,CryptoPP::DL_GroupParameters_IntegerBased> CryptoPP::GetValueHelper<CryptoPP::DL_GroupParameters_IntegerBased,CryptoPP::DL_GroupParameters_GFP>(const T *,const char *,const type_info &,void *,const CryptoPP::NameValuePairs *,BASE *)' being compiled
8> with
8> [
8> T=CryptoPP::DL_GroupParameters_GFP
8> , BASE=CryptoPP::DL_GroupParameters_IntegerBased
8> ]
8>c:\users\andrei-alina\desktop\incl+lib\include_stuff\cryptopp\misc.h(366): warning C4127: conditional expression is constant
8> C:\Users\Andrei-alina\Desktop\incl+lib\include_stuff\cryptopp/skipjack.h(25) : see reference to function template instantiation 'unsigned int CryptoPP::GetAlignmentOf<CryptoPP::word16>(T *)' being compiled
8> with
8> [
8> T=CryptoPP::word16
8> ]
8>c:\users\andrei-alina\desktop\incl+lib\include_stuff\cryptopp\misc.h(363): warning C4100: 'dummy' : unreferenced formal parameter
8>c:\users\andrei-alina\desktop\incl+lib\include_stuff\cryptopp\algparam.h(229): warning C4100: 'dummy' : unreferenced formal parameter
8> c:\users\andrei-alina\desktop\incl+lib\include_stuff\cryptopp\gfpcrypt.h(96) : see reference to function template instantiation 'CryptoPP::AssignFromHelperClass<CryptoPP::DL_GroupParameters_IntegerBasedImpl<CryptoPP::ModExpPrecomputation,CryptoPP::DL_FixedBasePrecomputationImpl<CryptoPP::Integer>>,CryptoPP::DL_GroupParameters_IntegerBased> CryptoPP::AssignFromHelper<CryptoPP::DL_GroupParameters_IntegerBased,CryptoPP::DL_GroupParameters_IntegerBasedImpl<CryptoPP::ModExpPrecomputation,CryptoPP::DL_FixedBasePrecomputationImpl<CryptoPP::Integer>>>(T *,const CryptoPP::NameValuePairs &,BASE *)' being compiled
8> with
8> [
8> T=CryptoPP::DL_GroupParameters_IntegerBasedImpl<CryptoPP::ModExpPrecomputation,CryptoPP::DL_FixedBasePrecomputationImpl<CryptoPP::Integer>>
8> , BASE=CryptoPP::DL_GroupParameters_IntegerBased
8> ]
8> c:\users\andrei-alina\desktop\incl+lib\include_stuff\cryptopp\gfpcrypt.h(96) : while compiling class template member function 'void CryptoPP::DL_GroupParameters_IntegerBasedImpl<CryptoPP::ModExpPrecomputation,CryptoPP::DL_FixedBasePrecomputationImpl<CryptoPP::Integer>>::AssignFrom(const CryptoPP::NameValuePairs &)'
8>c:\users\andrei-alina\desktop\incl+lib\include_stuff\cryptopp\misc.h(537): warning C4127: conditional expression is constant
8> c:\users\andrei-alina\desktop\incl+lib\include_stuff\cryptopp\secblock.h(105) : see reference to function template instantiation 'void CryptoPP::SecureWipeArray<T>(T *,size_t)' being compiled
8> with
8> [
8> T=byte
8> ]
8> c:\users\andrei-alina\desktop\incl+lib\include_stuff\cryptopp\secblock.h(104) : while compiling class template member function 'void CryptoPP::AllocatorWithCleanup<byte,false>::deallocate(void *,CryptoPP::AllocatorWithCleanup<byte,false>::size_type)'
8> c:\users\andrei-alina\desktop\incl+lib\include_stuff\cryptopp\secblock.h(261) : see reference to function template instantiation 'void CryptoPP::AllocatorWithCleanup<byte,false>::deallocate(void *,CryptoPP::AllocatorWithCleanup<byte,false>::size_type)' being compiled
8>c:\users\andrei-alina\desktop\incl+lib\include_stuff\cryptopp\misc.h(539): warning C4127: conditional expression is constant
8>c:\users\andrei-alina\desktop\incl+lib\include_stuff\cryptopp\misc.h(541): warning C4127: conditional expression is constant
8>c:\users\andrei-alina\desktop\incl+lib\include_stuff\cryptopp\algparam.h(226): warning C4512: 'CryptoPP::AssignFromHelperClass<CryptoPP::DL_PrivateKey<CryptoPP::Integer>,CryptoPP::DL_PrivateKey<CryptoPP::Integer>>' : assignment operator could not be generated
8> c:\users\andrei-alina\desktop\incl+lib\include_stuff\cryptopp\pubkey.h(697) : see reference to class template instantiation 'CryptoPP::AssignFromHelperClass<CryptoPP::DL_PrivateKey<CryptoPP::Integer>,CryptoPP::DL_PrivateKey<CryptoPP::Integer>>' being compiled
8> c:\users\andrei-alina\desktop\incl+lib\include_stuff\cryptopp\pubkey.h(695) : while compiling class template member function 'void CryptoPP::DL_PrivateKey<CryptoPP::Integer>::AssignFrom(const CryptoPP::NameValuePairs &)'
8> c:\users\andrei-alina\desktop\incl+lib\include_stuff\cryptopp\algparam.h(190) : see reference to function template instantiation 'void CryptoPP::DL_PrivateKey<CryptoPP::Integer>::AssignFrom(const CryptoPP::NameValuePairs &)' being compiled
8> c:\users\andrei-alina\desktop\incl+lib\include_stuff\cryptopp\pubkey.h(750) : see reference to class template instantiation 'CryptoPP::DL_PrivateKey<CryptoPP::Integer>' being compiled
8>c:\users\andrei-alina\desktop\incl+lib\include_stuff\cryptopp\algparam.h(226): warning C4512: 'CryptoPP::AssignFromHelperClass<CryptoPP::DL_PublicKey<T>,CryptoPP::DL_PublicKey<T>>' : assignment operator could not be generated
8> with
8> [
8> T=CryptoPP::Integer
8> ]
8> c:\users\andrei-alina\desktop\incl+lib\include_stuff\cryptopp\pubkey.h(714) : see reference to class template instantiation 'CryptoPP::AssignFromHelperClass<CryptoPP::DL_PublicKey<T>,CryptoPP::DL_PublicKey<T>>' being compiled
8> with
8> [
8> T=CryptoPP::Integer
8> ]
8> c:\users\andrei-alina\desktop\incl+lib\include_stuff\cryptopp\pubkey.h(707) : while compiling class template member function 'void CryptoPP::DL_PublicKey<T>::AssignFrom(const CryptoPP::NameValuePairs &)'
8> with
8> [
8> T=CryptoPP::Integer
8> ]
8> c:\users\andrei-alina\desktop\incl+lib\include_stuff\cryptopp\algparam.h(190) : see reference to function template instantiation 'void CryptoPP::DL_PublicKey<T>::AssignFrom(const CryptoPP::NameValuePairs &)' being compiled
8> with
8> [
8> T=CryptoPP::Integer
8> ]
8> c:\users\andrei-alina\desktop\incl+lib\include_stuff\cryptopp\algparam.h(86) : while compiling class template member function 'CryptoPP::GetValueHelperClass<CryptoPP::DL_PublicKeyImpl<GP>,CryptoPP::DL_PublicKey<T>>::GetValueHelperClass(const CryptoPP::DL_PublicKeyImpl<GP> *,const char *,const type_info &,void *,const CryptoPP::NameValuePairs *)'
8> with
8> [
8> GP=CryptoPP::DL_GroupParameters_DSA
8> , T=CryptoPP::Integer
8> ]
8> c:\users\andrei-alina\desktop\incl+lib\include_stuff\cryptopp\algparam.h(157) : see reference to function template instantiation 'CryptoPP::GetValueHelperClass<CryptoPP::DL_PublicKeyImpl<GP>,CryptoPP::DL_PublicKey<T>>::GetValueHelperClass(const CryptoPP::DL_PublicKeyImpl<GP> *,const char *,const type_info &,void *,const CryptoPP::NameValuePairs *)' being compiled
8> with
8> [
8> GP=CryptoPP::DL_GroupParameters_DSA
8> , T=CryptoPP::Integer
8> ]
8> c:\users\andrei-alina\desktop\incl+lib\include_stuff\cryptopp\pubkey.h(854) : see reference to class template instantiation 'CryptoPP::GetValueHelperClass<CryptoPP::DL_PublicKeyImpl<GP>,CryptoPP::DL_PublicKey<T>>' being compiled
8> with
8> [
8> GP=CryptoPP::DL_GroupParameters_DSA
8> , T=CryptoPP::Integer
8> ]
8>c:\users\andrei-alina\desktop\incl+lib\include_stuff\cryptopp\misc.h(548): warning C4505: 'CryptoPP::StringNarrow' : unreferenced local function has been removed
8> CPostIt.cpp
8> CRC32.cpp
9>------ Rebuild All started: Project: eterGrnLib, Configuration: Distribute Win32 ------
6>SpeedGrassWrapper.obj : warning LNK4221: This object file does not define any previously undefined public symbols, so it will not be used by any link operation that consumes this library
6>SpeedGrassRT.obj : warning LNK4221: This object file does not define any previously undefined public symbols, so it will not be used by any link operation that consumes this library
6> SpeedTreeLib_VC90.vcxproj -> C:\Users\Andrei-alina\Desktop\Sursa\SursaLauncher\SpeedTreeLib\.\Distribute\SpeedTreeLib.lib
9> StdAfx.cpp
8> Debug.cpp
10>------ Rebuild All started: Project: eterImageLib, Configuration: Distribute Win32 ------
10> StdAfx.cpp
10>c:\users\andrei-alina\desktop\sursa\sursalauncher\eterimagelib\stdafx.h(33): warning C4996: '_vsnprintf': This function or variable may be unsafe. Consider using _vsnprintf_s instead. To disable deprecation, use _CRT_SECURE_NO_WARNINGS. See online help for details.
10> C:\Program Files\Microsoft Visual Studio 12.0\VC\include\stdio.h(346) : see declaration of '_vsnprintf'
8> error.cpp
10> DXTCImage.cpp
9> LODController.cpp
8> FileBase.cpp
10>c:\users\andrei-alina\desktop\sursa\sursalauncher\eterimagelib\StdAfx.h(33): warning C4996: '_vsnprintf': This function or variable may be unsafe. Consider using _vsnprintf_s instead. To disable deprecation, use _CRT_SECURE_NO_WARNINGS. See online help for details.
10> C:\Program Files\Microsoft Visual Studio 12.0\VC\include\stdio.h(346) : see declaration of '_vsnprintf'
9> Material.cpp
8> FileDir.cpp
10>DXTCImage.cpp(95): warning C4996: 'strncpy': This function or variable may be unsafe. Consider using strncpy_s instead. To disable deprecation, use _CRT_SECURE_NO_WARNINGS. See online help for details.
10> C:\Program Files\Microsoft Visual Studio 12.0\VC\include\string.h(195) : see declaration of 'strncpy'
10>DXTCImage.cpp(96): warning C4996: 'strupr': The POSIX name for this item is deprecated. Instead, use the ISO C++ conformant name: _strupr. See online help for details.
10> C:\Program Files\Microsoft Visual Studio 12.0\VC\include\string.h(259) : see declaration of 'strupr'
10>DXTCImage.cpp(926): warning C4996: '_snprintf': This function or variable may be unsafe. Consider using _snprintf_s instead. To disable deprecation, use _CRT_SECURE_NO_WARNINGS. See online help for details.
10> C:\Program Files\Microsoft Visual Studio 12.0\VC\include\stdio.h(346) : see declaration of '_snprintf'
10>DXTCImage.cpp(932): warning C4996: 'strncpy': This function or variable may be unsafe. Consider using strncpy_s instead. To disable deprecation, use _CRT_SECURE_NO_WARNINGS. See online help for details.
10> C:\Program Files\Microsoft Visual Studio 12.0\VC\include\string.h(195) : see declaration of 'strncpy'
10>DXTCImage.cpp(937): warning C4996: 'strncpy': This function or variable may be unsafe. Consider using strncpy_s instead. To disable deprecation, use _CRT_SECURE_NO_WARNINGS. See online help for details.
10> C:\Program Files\Microsoft Visual Studio 12.0\VC\include\string.h(195) : see declaration of 'strncpy'
10>DXTCImage.cpp(942): warning C4996: 'strncpy': This function or variable may be unsafe. Consider using strncpy_s instead. To disable deprecation, use _CRT_SECURE_NO_WARNINGS. See online help for details.
10> C:\Program Files\Microsoft Visual Studio 12.0\VC\include\string.h(195) : see declaration of 'strncpy'
10>DXTCImage.cpp(947): warning C4996: 'strncpy': This function or variable may be unsafe. Consider using strncpy_s instead. To disable deprecation, use _CRT_SECURE_NO_WARNINGS. See online help for details.
10> C:\Program Files\Microsoft Visual Studio 12.0\VC\include\string.h(195) : see declaration of 'strncpy'
10>DXTCImage.cpp(952): warning C4996: 'strncpy': This function or variable may be unsafe. Consider using strncpy_s instead. To disable deprecation, use _CRT_SECURE_NO_WARNINGS. See online help for details.
10> C:\Program Files\Microsoft Visual Studio 12.0\VC\include\string.h(195) : see declaration of 'strncpy'
10>DXTCImage.cpp(957): warning C4996: 'strcpy': This function or variable may be unsafe. Consider using strcpy_s instead. To disable deprecation, use _CRT_SECURE_NO_WARNINGS. See online help for details.
10> C:\Program Files\Microsoft Visual Studio 12.0\VC\include\string.h(112) : see declaration of 'strcpy'
10> Image.cpp
8> FileLoader.cpp
10>c:\users\andrei-alina\desktop\sursa\sursalauncher\eterimagelib\StdAfx.h(33): warning C4996: '_vsnprintf': This function or variable may be unsafe. Consider using _vsnprintf_s instead. To disable deprecation, use _CRT_SECURE_NO_WARNINGS. See online help for details.
10> C:\Program Files\Microsoft Visual Studio 12.0\VC\include\stdio.h(346) : see declaration of '_vsnprintf'
9>c:\users\andrei-alina\desktop\sursa\sursalauncher\etergrnlib\../eterbase/Filename.h(236): warning C4996: 'strcpy': This function or variable may be unsafe. Consider using strcpy_s instead. To disable deprecation, use _CRT_SECURE_NO_WARNINGS. See online help for details.
9> C:\Program Files\Microsoft Visual Studio 12.0\VC\include\string.h(112) : see declaration of 'strcpy'
10> TGAImage.cpp
9>Material.cpp(209): warning C4996: '_snprintf': This function or variable may be unsafe. Consider using _snprintf_s instead. To disable deprecation, use _CRT_SECURE_NO_WARNINGS. See online help for details.
9> C:\Program Files\Microsoft Visual Studio 12.0\VC\include\stdio.h(346) : see declaration of '_snprintf'
9>Material.cpp(230): warning C4996: 'strnicmp': The POSIX name for this item is deprecated. Instead, use the ISO C++ conformant name: _strnicmp. See online help for details.
9> C:\Program Files\Microsoft Visual Studio 12.0\VC\include\string.h(255) : see declaration of 'strnicmp'
9> Mesh.cpp
8> lzo.cpp
10>c:\users\andrei-alina\desktop\sursa\sursalauncher\eterimagelib\StdAfx.h(33): warning C4996: '_vsnprintf': This function or variable may be unsafe. Consider using _vsnprintf_s instead. To disable deprecation, use _CRT_SECURE_NO_WARNINGS. See online help for details.
10> C:\Program Files\Microsoft Visual Studio 12.0\VC\include\stdio.h(346) : see declaration of '_vsnprintf'
10>TGAImage.cpp(311): warning C4996: 'fopen': This function or variable may be unsafe. Consider using fopen_s instead. To disable deprecation, use _CRT_SECURE_NO_WARNINGS. See online help for details.
10> C:\Program Files\Microsoft Visual Studio 12.0\VC\include\stdio.h(211) : see declaration of 'fopen'
10> Generating Code...
9> Model.cpp
8> MappedFile.cpp
10> eterImageLib_VC90.vcxproj -> C:\Users\Andrei-alina\Desktop\Sursa\SursaLauncher\eterImageLib\.\Distribute\eterImageLib.lib
11>------ Rebuild All started: Project: eterPythonLib, Configuration: Distribute Win32 ------
11> StdAfx.cpp
8> Base.cpp
9> ModelInstance.cpp
8> Poly.cpp
11>C:\Users\Andrei-alina\Desktop\incl+lib\include_stuff\mss.h(1044): warning C4005: 'AT' : macro redefinition
11> C:\Users\Andrei-alina\Desktop\incl+lib\include_stuff\Python27/token.h(62) : see previous definition of 'AT'
9> ModelInstanceCollisionDetection.cpp
8> Symbol.cpp
11> PythonGraphic.cpp
11> PythonGraphicImageModule.cpp
11> PythonGraphicModule.cpp
8> SymTable.cpp
9> ModelInstanceModel.cpp
11> PythonGraphicTextModule.cpp
11> PythonGraphicThingModule.cpp
11> PythonGridSlotWindow.cpp
11> PythonSlotWindow.cpp
8> Random.cpp
11> PythonWindow.cpp
11> PythonWindowManager.cpp
11> PythonWindowManagerModule.cpp
11> Generating Code...
9> ModelInstanceMotion.cpp
8> StdAfx.cpp
8> Stl.cpp
9> ModelInstanceRender.cpp
8> tea.cpp
11> eterPythonLib_VC90.vcxproj -> C:\Users\Andrei-alina\Desktop\Sursa\SursaLauncher\eterPythonLib\.\Distribute\eterPythonLib.lib
12>------ Rebuild All started: Project: eterlib, Configuration: Distribute Win32 ------
9> ModelInstanceUpdate.cpp
12> StdAfx.cpp
8> TempFile.cpp
8> Timer.cpp
9> Motion.cpp
12> AttributeData.cpp
12> AttributeInstance.cpp
12> BlockTexture.cpp
8> Generating Code...
12> Camera.cpp
9>Motion.cpp(66): warning C4996: 'stricmp': The POSIX name for this item is deprecated. Instead, use the ISO C++ conformant name: _stricmp. See online help for details.
9> C:\Program Files\Microsoft Visual Studio 12.0\VC\include\string.h(253) : see declaration of 'stricmp'
12> CollisionData.cpp
9> Thing.cpp
12> ColorTransitionHelper.cpp
12> CullingManager.cpp
12> Decal.cpp
12> DibBar.cpp
12> EnvironmentMap.cpp
12> FileLoaderThread.cpp
12> Unknown compiler version - please run the configure tests and report the results
9> ThingInstance.cpp
12> GrpBase.cpp
12> GrpCollisionObject.cpp
12> GrpColor.cpp
12> GrpColorInstance.cpp
12> GrpD3DXBuffer.cpp
12> GrpDetector.cpp
12> GrpDevice.cpp
12> GrpDIB.cpp
12> GrpExpandedImageInstance.cpp
12> Generating Code...
9> Util.cpp
8> Compiling...
8> Utils.cpp
9> Generating Code...
12> Compiling...
12> GrpFontTexture.cpp
12> GrpImage.cpp
12> GrpImageInstance.cpp
12> GrpImageTexture.cpp
8>Utils.cpp(340): warning C4127: conditional expression is constant
12> Unknown compiler version - please run the configure tests and report the results
8> Generating Code...
8>c:\users\andrei-alina\desktop\sursa\sursalauncher\eterbase\utils.cpp(627): warning C4706: assignment within conditional expression
12> GrpIndexBuffer.cpp
12> GrpLightManager.cpp
4> md5.c
12> GrpMarkInstance.cpp
8>StdAfx.obj : warning LNK4221: This object file does not define any previously undefined public symbols, so it will not be used by any link operation that consumes this library
8> eterBase_VC90.vcxproj -> C:\Users\Andrei-alina\Desktop\Sursa\SursaLauncher\EterBase\.\Distribute\eterBase.lib
12> GrpMath.cpp
12> GrpObjectInstance.cpp
4> EterPack_VC90.vcxproj -> C:\Users\Andrei-alina\Desktop\Sursa\SursaLauncher\EterPack\.\Distribute\EterPack.lib
13>------ Rebuild All started: Project: gamelib, Configuration: Distribute Win32 ------
14>------ Rebuild All started: Project: mileslib, Configuration: Distribute Win32 ------
12> GrpPixelShader.cpp
12> GrpRatioInstance.cpp
12> GrpScreen.cpp
12> GrpShadowTexture.cpp
12> GrpSubImage.cpp
13> StdAfx.cpp
14> Stdafx.cpp
12> GrpText.cpp
12> GrpTextInstance.cpp
12> GrpTexture.cpp
12> GrpVertexBuffer.cpp
14> SoundBase.cpp
12> GrpVertexBufferDynamic.cpp
12> GrpVertexBufferStatic.cpp
12> Generating Code...
14> SoundData.cpp
14> Unknown compiler version - please run the configure tests and report the results
12> Compiling...
12> GrpVertexShader.cpp
13> ActorInstance.cpp
12> IME.cpp
14>SoundData.cpp(19): warning C4996: 'strncpy': This function or variable may be unsafe. Consider using strncpy_s instead. To disable deprecation, use _CRT_SECURE_NO_WARNINGS. See online help for details.
14> C:\Program Files\Microsoft Visual Studio 12.0\VC\include\string.h(195) : see declaration of 'strncpy'
14> SoundInstance2D.cpp
12>IME.cpp(309): warning C4996: 'GetVersionExA': was declared deprecated
12> C:\Program Files\Windows Kits\8.1\Include\um\sysinfoapi.h(433) : see declaration of 'GetVersionExA'
12>IME.cpp(1182): warning C4996: 'GetVersionExA': was declared deprecated
12> C:\Program Files\Windows Kits\8.1\Include\um\sysinfoapi.h(433) : see declaration of 'GetVersionExA'
12> Input.cpp
12> JpegFile.cpp
12> LensFlare.cpp
12> lineintersect_utils.cpp
12> MSApplication.cpp
12> MSWindow.cpp
14> SoundInstance3D.cpp
12> Mutex.cpp
12> NetAddress.cpp
13> ActorInstanceAttach.cpp
12> NetDatagram.cpp
12> NetDatagramReceiver.cpp
12> NetDatagramSender.cpp
12> NetDevice.cpp
12> NetPacketHeaderMap.cpp
12> NetStream.cpp
14> SoundInstanceStream.cpp
12> parser.cpp
12> PathStack.cpp
12> ReferenceObject.cpp
12> Resource.cpp
12> Unknown compiler version - please run the configure tests and report the results
14> SoundManager.cpp
13> ActorInstanceBattle.cpp
12> Generating Code...
14> SoundManager2D.cpp
13> ActorInstanceBlend.cpp
14> SoundManager3D.cpp
12> Compiling...
12> ResourceManager.cpp
12> Unknown compiler version - please run the configure tests and report the results
14> SoundManagerStream.cpp
13> ActorInstanceCollisionDetection.cpp
12> ScreenFilter.cpp
14> Type.cpp
12> SkyBox.cpp
12> StateManager.cpp
12> TargaResource.cpp
12> TextBar.cpp
14>Type.cpp(48): warning C4996: '_snprintf': This function or variable may be unsafe. Consider using _snprintf_s instead. To disable deprecation, use _CRT_SECURE_NO_WARNINGS. See online help for details.
14> C:\Program Files\Microsoft Visual Studio 12.0\VC\include\stdio.h(346) : see declaration of '_snprintf'
14>Type.cpp(92): warning C4996: 'fopen': This function or variable may be unsafe. Consider using fopen_s instead. To disable deprecation, use _CRT_SECURE_NO_WARNINGS. See online help for details.
14> C:\Program Files\Microsoft Visual Studio 12.0\VC\include\stdio.h(211) : see declaration of 'fopen'
14>Type.cpp(97): warning C4996: '_snprintf': This function or variable may be unsafe. Consider using _snprintf_s instead. To disable deprecation, use _CRT_SECURE_NO_WARNINGS. See online help for details.
14> C:\Program Files\Microsoft Visual Studio 12.0\VC\include\stdio.h(346) : see declaration of '_snprintf'
12> TextFileLoader.cpp
13> ActorInstanceData.cpp
12> Unknown compiler version - please run the configure tests and report the results
14> Generating Code...
12> TextTag.cpp
12> Thread.cpp
12> Util.cpp
12> Unknown compiler version - please run the configure tests and report the results
13> ActorInstanceEvent.cpp
12> Generating Code...
14> mileslib_VC90.vcxproj -> C:\Users\Andrei-alina\Desktop\Sursa\SursaLauncher\MilesLib\.\Distribute\mileslib.lib
15>------ Rebuild All started: Project: scriptLib, Configuration: Distribute Win32 ------
13> ActorInstanceFly.cpp
15> StdAfx.cpp
15>C:\Users\Andrei-alina\Desktop\incl+lib\include_stuff\mss.h(1044): warning C4005: 'AT' : macro redefinition
15> C:\Users\Andrei-alina\Desktop\incl+lib\include_stuff\Python27/token.h(62) : see previous definition of 'AT'
13> ActorInstanceMotion.cpp
9> eterGrnLib_VC90.vcxproj -> C:\Users\Andrei-alina\Desktop\Sursa\SursaLauncher\eterGrnLib\.\Distribute\eterGrnLib.lib
15> PythonDebugModule.cpp
15> PythonLauncher.cpp
15> Unknown compiler version - please run the configure tests and report the results
12> eterlib_VC90.vcxproj -> C:\Users\Andrei-alina\Desktop\Sursa\SursaLauncher\EterLib\.\Distribute\eterlib.lib
13> ActorInstanceMotionEvent.cpp
15> PythonMarshal.cpp
15> PythonUtils.cpp
15> Resource.cpp
13> ActorInstancePosition.cpp
15> Generating Code...
13> ActorInstanceRender.cpp
15> scriptLib_VC90.vcxproj -> C:\Users\Andrei-alina\Desktop\Sursa\SursaLauncher\scriptLib\.\Distribute\scriptLib.lib
13> ActorInstanceRotation.cpp
13> ActorInstanceSync.cpp
13> ActorInstanceWeaponTrace.cpp
13> Area.cpp
13> Unknown compiler version - please run the configure tests and report the results
13> AreaLoaderThread.cpp
13> AreaTerrain.cpp
13>C:\Users\Andrei-alina\Desktop\incl+lib\include_stuff\Python27/token.h(62): warning C4005: 'AT' : macro redefinition
13> C:\Users\Andrei-alina\Desktop\incl+lib\include_stuff\mss.h(1044) : see previous definition of 'AT'
13> Unknown compiler version - please run the configure tests and report the results
13> DungeonBlock.cpp
13> FlyingData.cpp
13> Generating Code...
13> Compiling...
13> FlyingInstance.cpp
13> Unknown compiler version - please run the configure tests and report the results
13> FlyingObjectManager.cpp
13> FlyTarget.cpp
13> FlyTrace.cpp
13> GameEventManager.cpp
13> GameType.cpp
13> GameUtil.cpp
13> ItemData.cpp
13> ItemManager.cpp
13> Unknown compiler version - please run the configure tests and report the results
13> MapBase.cpp
13> MapManager.cpp
13> Unknown compiler version - please run the configure tests and report the results
13> MapOutdoor.cpp
13>C:\Users\Andrei-alina\Desktop\incl+lib\include_stuff\Python27/token.h(62): warning C4005: 'AT' : macro redefinition
13> C:\Users\Andrei-alina\Desktop\incl+lib\include_stuff\mss.h(1044) : see previous definition of 'AT'
13> MapOutdoorCharacterShadow.cpp
13> MapOutdoorIndexBuffer.cpp
13> MapOutdoorLoad.cpp
13> Unknown compiler version - please run the configure tests and report the results
13> MapOutdoorQuadtree.cpp
13> MapOutdoorRender.cpp
13> MapOutdoorRenderHTP.cpp
13> MapOutdoorRenderSTP.cpp
13> MapOutdoorUpdate.cpp
13>C:\Users\Andrei-alina\Desktop\incl+lib\include_stuff\Python27/token.h(62): warning C4005: 'AT' : macro redefinition
13> C:\Users\Andrei-alina\Desktop\incl+lib\include_stuff\mss.h(1044) : see previous definition of 'AT'
13> Generating Code...
13> Compiling...
13> MapOutdoorWater.cpp
13> MapType.cpp
13> MapUtil.cpp
13> MonsterAreaInfo.cpp
13> PhysicsObject.cpp
13> Property.cpp
13> Unknown compiler version - please run the configure tests and report the results
13> PropertyLoader.cpp
13> Unknown compiler version - please run the configure tests and report the results
13> PropertyManager.cpp
13> Unknown compiler version - please run the configure tests and report the results
13> RaceData.cpp
13> RaceDataFile.cpp
13> RaceManager.cpp
13> Unknown compiler version - please run the configure tests and report the results
13> RaceMotionData.cpp
13> SnowEnvironment.cpp
13> SnowParticle.cpp
13> TerrainDecal.cpp
13>C:\Users\Andrei-alina\Desktop\incl+lib\include_stuff\Python27/token.h(62): warning C4005: 'AT' : macro redefinition
13> C:\Users\Andrei-alina\Desktop\incl+lib\include_stuff\mss.h(1044) : see previous definition of 'AT'
13> TerrainPatch.cpp
13> TerrainQuadtree.cpp
13> WeaponTrace.cpp
13> Generating Code...
13> gamelib_VC90.vcxproj -> C:\Users\Andrei-alina\Desktop\Sursa\SursaLauncher\GameLib\.\Distribute\gamelib.lib
16>------ Rebuild All started: Project: UserInterface, Configuration: Distribute Win32 ------
16> StdAfx.cpp
16>C:\Users\Andrei-alina\Desktop\incl+lib\include_stuff\mss.h(1044): warning C4005: 'AT' : macro redefinition
16> C:\Users\Andrei-alina\Desktop\incl+lib\include_stuff\Python27/token.h(62) : see previous definition of 'AT'
16> AccountConnector.cpp
16> Unknown compiler version - please run the configure tests and report the results
16> AffectFlagContainer.cpp
16> CameraProcedure.cpp
16> Unknown compiler version - please run the configure tests and report the results
16> CheckLatestFiles.cpp
16> GameType.cpp
16> GuildMarkDownloader.cpp
16> GuildMarkUploader.cpp
16> Hackshield.cpp
16> InstanceBase.cpp
16> Unknown compiler version - please run the configure tests and report the results
16> InstanceBaseBattle.cpp
16> Unknown compiler version - please run the configure tests and report the results
16> InstanceBaseEffect.cpp
16> InstanceBaseEvent.cpp
16> InstanceBaseMotion.cpp
16> InstanceBaseMovement.cpp
16> Unknown compiler version - please run the configure tests and report the results
16> InstanceBaseTransform.cpp
16> Unknown compiler version - please run the configure tests and report the results
16> InsultChecker.cpp
16> Locale.cpp
16> Unknown compiler version - please run the configure tests and report the results
16> MarkImage.cpp
16> MarkManager.cpp
16>MarkManager.cpp(26): warning C4996: 'mkdir': The POSIX name for this item is deprecated. Instead, use the ISO C++ conformant name: _mkdir. See online help for details.
16> C:\Program Files\Microsoft Visual Studio 12.0\VC\include\direct.h(140) : see declaration of 'mkdir'
16> MovieMan.cpp
16> Unknown compiler version - please run the configure tests and report the results
16> Generating Code...
16>c:\users\andrei-alina\desktop\sursa\sursalauncher\userinterface\instancebase.cpp(561): warning C4715: 'CInstanceBase::GetAlignmentType' : not all control paths return a value
16> Compiling...
16> NetworkActorManager.cpp
16>NetworkActorManager.cpp(370): warning C4800: 'BOOL' : forcing value to bool 'true' or 'false' (performance warning)
16>NetworkActorManager.cpp(420): warning C4800: 'BOOL' : forcing value to bool 'true' or 'false' (performance warning)
16> NProtectGameGuard.cpp
16> ProcessCRC.cpp
16> ProcessScanner.cpp
16> PythonApplication.cpp
16> Unknown compiler version - please run the configure tests and report the results
16> PythonApplicationCamera.cpp
16> Unknown compiler version - please run the configure tests and report the results
16> PythonApplicationCursor.cpp
16> Unknown compiler version - please run the configure tests and report the results
16> PythonApplicationEvent.cpp
16> Unknown compiler version - please run the configure tests and report the results
16> PythonApplicationLogo.cpp
16> Unknown compiler version - please run the configure tests and report the results
16> PythonApplicationModule.cpp
16> Unknown compiler version - please run the configure tests and report the results
16> PythonApplicationProcedure.cpp
16> Unknown compiler version - please run the configure tests and report the results
16> PythonApplicationWebPage.cpp
16> Unknown compiler version - please run the configure tests and report the results
16> PythonBackground.cpp
16> Unknown compiler version - please run the configure tests and report the results
16> PythonBackgroundModule.cpp
16> Unknown compiler version - please run the configure tests and report the results
16> PythonCharacterManager.cpp
16> Unknown compiler version - please run the configure tests and report the results
16> PythonCharacterManagerModule.cpp
16> Unknown compiler version - please run the configure tests and report the results
16> PythonCharacterModule.cpp
16> PythonChat.cpp
16> PythonChatModule.cpp
16> PythonEffectModule.cpp
16> Generating Code...
16> Compiling...
16> PythonEventManager.cpp
16> Unknown compiler version - please run the configure tests and report the results
16> PythonEventManagerMoudle.cpp
16> PythonExceptionSender.cpp
16> PythonExchange.cpp
16> PythonExchangeModule.cpp
16> PythonFlyModule.cpp
16> PythonGameEventManagerModule.cpp
16> PythonGuild.cpp
16> PythonIME.cpp
16> PythonIMEModule.cpp
16> Unknown compiler version - please run the configure tests and report the results
16> PythonItem.cpp
16> Unknown compiler version - please run the configure tests and report the results
16> PythonItemModule.cpp
16> PythonMessenger.cpp
16> PythonMiniMap.cpp
16> Unknown compiler version - please run the configure tests and report the results
16> PythonMiniMapModule.cpp
16> Unknown compiler version - please run the configure tests and report the results
16> PythonNetworkDatagram.cpp
16> PythonNetworkDatagramModule.cpp
16> PythonNetworkStream.cpp
16> PythonNetworkStreamCommand.cpp
16> PythonNetworkStreamEvent.cpp
16> Generating Code...
16> Compiling...
16> PythonNetworkStreamModule.cpp
16> PythonNetworkStreamPhaseGame.cpp
16> Unknown compiler version - please run the configure tests and report the results
16> PythonNetworkStreamPhaseGameActor.cpp
16> Unknown compiler version - please run the configure tests and report the results
16> PythonNetworkStreamPhaseGameItem.cpp
16> PythonNetworkStreamPhaseHandShake.cpp
16> Unknown compiler version - please run the configure tests and report the results
16> PythonNetworkStreamPhaseLoading.cpp
16> Unknown compiler version - please run the configure tests and report the results
16> PythonNetworkStreamPhaseLogin.cpp
16> PythonNetworkStreamPhaseOffline.cpp
16> Unknown compiler version - please run the configure tests and report the results
16> PythonNetworkStreamPhaseSelect.cpp
16> PythonNonPlayer.cpp
16> Unknown compiler version - please run the configure tests and report the results
16> PythonNonPlayerModule.cpp
16> PythonPackModule.cpp
16> Unknown compiler version - please run the configure tests and report the results
16> PythonPlayer.cpp
16> Unknown compiler version - please run the configure tests and report the results
16> PythonPlayerEventHandler.cpp
16> PythonPlayerInput.cpp
16> Unknown compiler version - please run the configure tests and report the results
16> PythonPlayerInputKeyboard.cpp
16> PythonPlayerInputMouse.cpp
16> Unknown compiler version - please run the configure tests and report the results
16> PythonPlayerModule.cpp
16> Unknown compiler version - please run the configure tests and report the results
16>PythonPlayerModule.cpp(773): warning C4101: 'iSourceSlotIndex' : unreferenced local variable
16>PythonPlayerModule.cpp(988): warning C4101: 'iSlotPos' : unreferenced local variable
16> PythonPlayerSkill.cpp
16> PythonProfilerModule.cpp
16> Generating Code...
16> Compiling...
16> PythonQuest.cpp
16> PythonSafeBox.cpp
16> PythonShop.cpp
16> PythonSkill.cpp
16> Unknown compiler version - please run the configure tests and report the results
16> PythonSoundManagerModule.cpp
16> Unknown compiler version - please run the configure tests and report the results
16> PythonSystem.cpp
16> Unknown compiler version - please run the configure tests and report the results
16> PythonSystemModule.cpp
16> PythonTextTail.cpp
16> PythonTextTailModule.cpp
16> ServerStateChecker.cpp
16> ServerStateCheckerModule.cpp
16> UserInterface.cpp
16> Unknown compiler version - please run the configure tests and report the results
16> WiseLogicXTrap.cpp
16> Generating Code...
16>C:\Program Files\MSBuild\Microsoft.Cpp\v4.0\V120\Microsoft.CppBuild.targets(1193,5): warning MSB8012: TargetPath(C:\Users\Andrei-alina\Desktop\Sursa\SursaLauncher\UserInterface\../bin\UserInterface.exe) does not match the Linker's OutputFile property value (C:\Users\Andrei-alina\Desktop\Sursa\SursaLauncher\UserInterface\Distribute\metin2client.exe). This may cause your project to build incorrectly. To correct this, please make sure that $(OutDir), $(TargetName) and $(TargetExt) property values match the value specified in %(Link.OutputFile).
16>C:\Program Files\MSBuild\Microsoft.Cpp\v4.0\V120\Microsoft.CppBuild.targets(1195,5): warning MSB8012: TargetName(UserInterface) does not match the Linker's OutputFile property value (metin2client). This may cause your project to build incorrectly. To correct this, please make sure that $(OutDir), $(TargetName) and $(TargetExt) property values match the value specified in %(Link.OutputFile).
16>d3dx8.lib(d3dxmath.obj) : error LNK2026: module unsafe for SAFESEH image.
16>d3dx8.lib(cstack.obj) : error LNK2026: module unsafe for SAFESEH image.
16>d3dx8.lib(shapes.obj) : error LNK2026: module unsafe for SAFESEH image.
16>d3dx8.lib(d3dx8tex.obj) : error LNK2026: module unsafe for SAFESEH image.
16>d3dx8.lib(createmesh.obj) : error LNK2026: module unsafe for SAFESEH image.
16>d3dx8.lib(cpudetect.obj) : error LNK2026: module unsafe for SAFESEH image.
16>d3dx8.lib(d3dx8dbg.obj) : error LNK2026: module unsafe for SAFESEH image.
16>d3dx8.lib(cd3dximage.obj) : error LNK2026: module unsafe for SAFESEH image.
16>d3dx8.lib(cd3dxblt.obj) : error LNK2026: module unsafe for SAFESEH image.
16>d3dx8.lib(cd3dxlock.obj) : error LNK2026: module unsafe for SAFESEH image.
16>d3dx8.lib(cd3dxcodec.obj) : error LNK2026: module unsafe for SAFESEH image.
16>d3dx8.lib(cd3dxfile.obj) : error LNK2026: module unsafe for SAFESEH image.
16>d3dx8.lib(cd3dxresource.obj) : error LNK2026: module unsafe for SAFESEH image.
16>d3dx8.lib(cd3dxbuffer.obj) : error LNK2026: module unsafe for SAFESEH image.
16>d3dx8.lib(loadx.obj) : error LNK2026: module unsafe for SAFESEH image.
16>d3dx8.lib(cleanmesh.obj) : error LNK2026: module unsafe for SAFESEH image.
16>d3dx8.lib(ssefasttable.obj) : error LNK2026: module unsafe for SAFESEH image.
16>d3dx8.lib(ssefasttable2.obj) : error LNK2026: module unsafe for SAFESEH image.
16>d3dx8.lib(d3dxmathx3d.obj) : error LNK2026: module unsafe for SAFESEH image.
16>d3dx8.lib(d3dxmathx86.obj) : error LNK2026: module unsafe for SAFESEH image.
16>d3dx8.lib(jdapimin.obj) : error LNK2026: module unsafe for SAFESEH image.
16>d3dx8.lib(jdapistd.obj) : error LNK2026: module unsafe for SAFESEH image.
16>d3dx8.lib(jdmarker.obj) : error LNK2026: module unsafe for SAFESEH image.
16>d3dx8.lib(jerror.obj) : error LNK2026: module unsafe for SAFESEH image.
16>d3dx8.lib(pngerror.obj) : error LNK2026: module unsafe for SAFESEH image.
16>d3dx8.lib(pngread.obj) : error LNK2026: module unsafe for SAFESEH image.
16>d3dx8.lib(pngget.obj) : error LNK2026: module unsafe for SAFESEH image.
16>d3dx8.lib(pngtrans.obj) : error LNK2026: module unsafe for SAFESEH image.
16>d3dx8.lib(pngrtran.obj) : error LNK2026: module unsafe for SAFESEH image.
16>d3dx8.lib(pngset.obj) : error LNK2026: module unsafe for SAFESEH image.
16>d3dx8.lib(pngrio.obj) : error LNK2026: module unsafe for SAFESEH image.
16>d3dx8.lib(png.obj) : error LNK2026: module unsafe for SAFESEH image.
16>d3dx8.lib(dxtn.obj) : error LNK2026: module unsafe for SAFESEH image.
16>d3dx8.lib(loadutil.obj) : error LNK2026: module unsafe for SAFESEH image.
16>d3dx8.lib(cd3dxstack.obj) : error LNK2026: module unsafe for SAFESEH image.
16>d3dx8.lib(d3dxmathsse.obj) : error LNK2026: module unsafe for SAFESEH image.
16>d3dx8.lib(d3dxquatsse.obj) : error LNK2026: module unsafe for SAFESEH image.
16>d3dx8.lib(d3dxmathsse2.obj) : error LNK2026: module unsafe for SAFESEH image.
16>d3dx8.lib(d3dxquatsse2.obj) : error LNK2026: module unsafe for SAFESEH image.
16>d3dx8.lib(x3d_quat.obj) : error LNK2026: module unsafe for SAFESEH image.
16>d3dx8.lib(x3d_matx.obj) : error LNK2026: module unsafe for SAFESEH image.
16>d3dx8.lib(x3d_vec3.obj) : error LNK2026: module unsafe for SAFESEH image.
16>d3dx8.lib(x3d_vec2.obj) : error LNK2026: module unsafe for SAFESEH image.
16>d3dx8.lib(x3d_vec4.obj) : error LNK2026: module unsafe for SAFESEH image.
16>d3dx8.lib(x3d_plane.obj) : error LNK2026: module unsafe for SAFESEH image.
16>d3dx8.lib(jutils.obj) : error LNK2026: module unsafe for SAFESEH image.
16>d3dx8.lib(jdinput.obj) : error LNK2026: module unsafe for SAFESEH image.
16>d3dx8.lib(jmemmgr.obj) : error LNK2026: module unsafe for SAFESEH image.
16>d3dx8.lib(jcomapi.obj) : error LNK2026: module unsafe for SAFESEH image.
16>d3dx8.lib(jdmaster.obj) : error LNK2026: module unsafe for SAFESEH image.
16>d3dx8.lib(inflate.obj) : error LNK2026: module unsafe for SAFESEH image.
16>d3dx8.lib(pngmem.obj) : error LNK2026: module unsafe for SAFESEH image.
16>d3dx8.lib(pngrutil.obj) : error LNK2026: module unsafe for SAFESEH image.
16>d3dx8.lib(crc32.obj) : error LNK2026: module unsafe for SAFESEH image.
16>d3dx8.lib(d3dxtrigsse.obj) : error LNK2026: module unsafe for SAFESEH image.
16>d3dx8.lib(d3dxtrigsse2.obj) : error LNK2026: module unsafe for SAFESEH image.
16>d3dx8.lib(math.obj) : error LNK2026: module unsafe for SAFESEH image.
16>d3dx8.lib(jmemnobs.obj) : error LNK2026: module unsafe for SAFESEH image.
16>d3dx8.lib(jdmainct.obj) : error LNK2026: module unsafe for SAFESEH image.
16>d3dx8.lib(jdcoefct.obj) : error LNK2026: module unsafe for SAFESEH image.
16>d3dx8.lib(jdhuff.obj) : error LNK2026: module unsafe for SAFESEH image.
16>d3dx8.lib(jdphuff.obj) : error LNK2026: module unsafe for SAFESEH image.
16>d3dx8.lib(jddctmgr.obj) : error LNK2026: module unsafe for SAFESEH image.
16>d3dx8.lib(jdpostct.obj) : error LNK2026: module unsafe for SAFESEH image.
16>d3dx8.lib(jdsample.obj) : error LNK2026: module unsafe for SAFESEH image.
16>d3dx8.lib(jdcolor.obj) : error LNK2026: module unsafe for SAFESEH image.
16>d3dx8.lib(jdmerge.obj) : error LNK2026: module unsafe for SAFESEH image.
16>d3dx8.lib(jquant2.obj) : error LNK2026: module unsafe for SAFESEH image.
16>d3dx8.lib(jquant1.obj) : error LNK2026: module unsafe for SAFESEH image.
16>d3dx8.lib(infblock.obj) : error LNK2026: module unsafe for SAFESEH image.
16>d3dx8.lib(adler32.obj) : error LNK2026: module unsafe for SAFESEH image.
16>d3dx8.lib(zutil.obj) : error LNK2026: module unsafe for SAFESEH image.
16>d3dx8.lib(jidctred.obj) : error LNK2026: module unsafe for SAFESEH image.
16>d3dx8.lib(jidctint.obj) : error LNK2026: module unsafe for SAFESEH image.
16>d3dx8.lib(jidctfst.obj) : error LNK2026: module unsafe for SAFESEH image.
16>d3dx8.lib(jidctflt.obj) : error LNK2026: module unsafe for SAFESEH image.
16>d3dx8.lib(infcodes.obj) : error LNK2026: module unsafe for SAFESEH image.
16>d3dx8.lib(inftrees.obj) : error LNK2026: module unsafe for SAFESEH image.
16>d3dx8.lib(infutil.obj) : error LNK2026: module unsafe for SAFESEH image.
16>d3dx8.lib(piint.obj) : error LNK2026: module unsafe for SAFESEH image.
16>d3dx8.lib(miint.obj) : error LNK2026: module unsafe for SAFESEH image.
16>d3dx8.lib(pifst.obj) : error LNK2026: module unsafe for SAFESEH image.
16>d3dx8.lib(mifst.obj) : error LNK2026: module unsafe for SAFESEH image.
16>d3dx8.lib(inffast.obj) : error LNK2026: module unsafe for SAFESEH image.
16>granny2.lib(granny2.dll) : error LNK2026: module unsafe for SAFESEH image.
16>granny2.lib(granny2.dll) : error LNK2026: module unsafe for SAFESEH image.
16>granny2.lib(granny2.dll) : error LNK2026: module unsafe for SAFESEH image.
16>granny2.lib(granny2.dll) : error LNK2026: module unsafe for SAFESEH image.
16>granny2.lib(granny2.dll) : error LNK2026: module unsafe for SAFESEH image.
16>granny2.lib(granny2.dll) : error LNK2026: module unsafe for SAFESEH image.
16>granny2.lib(granny2.dll) : error LNK2026: module unsafe for SAFESEH image.
16>granny2.lib(granny2.dll) : error LNK2026: module unsafe for SAFESEH image.
16>granny2.lib(granny2.dll) : error LNK2026: module unsafe for SAFESEH image.
16>granny2.lib(granny2.dll) : error LNK2026: module unsafe for SAFESEH image.
16>granny2.lib(granny2.dll) : error LNK2026: module unsafe for SAFESEH image.
16>granny2.lib(granny2.dll) : error LNK2026: module unsafe for SAFESEH image.
16>granny2.lib(granny2.dll) : error LNK2026: module unsafe for SAFESEH image.
16>granny2.lib(granny2.dll) : error LNK2026: module unsafe for SAFESEH image.
16>granny2.lib(granny2.dll) : error LNK2026: module unsafe for SAFESEH image.
16>granny2.lib(granny2.dll) : error LNK2026: module unsafe for SAFESEH image.
16>granny2.lib(granny2.dll) : error LNK2026: module unsafe for SAFESEH image.
16>granny2.lib(granny2.dll) : error LNK2026: module unsafe for SAFESEH image.
16>granny2.lib(granny2.dll) : error LNK2026: module unsafe for SAFESEH image.
16>granny2.lib(granny2.dll) : error LNK2026: module unsafe for SAFESEH image.
16>granny2.lib(granny2.dll) : error LNK2026: module unsafe for SAFESEH image.
16>granny2.lib(granny2.dll) : error LNK2026: module unsafe for SAFESEH image.
16>granny2.lib(granny2.dll) : error LNK2026: module unsafe for SAFESEH image.
16>granny2.lib(granny2.dll) : error LNK2026: module unsafe for SAFESEH image.
16>granny2.lib(granny2.dll) : error LNK2026: module unsafe for SAFESEH image.
16>granny2.lib(granny2.dll) : error LNK2026: module unsafe for SAFESEH image.
16>granny2.lib(granny2.dll) : error LNK2026: module unsafe for SAFESEH image.
16>granny2.lib(granny2.dll) : error LNK2026: module unsafe for SAFESEH image.
16>granny2.lib(granny2.dll) : error LNK2026: module unsafe for SAFESEH image.
16>granny2.lib(granny2.dll) : error LNK2026: module unsafe for SAFESEH image.
16>granny2.lib(granny2.dll) : error LNK2026: module unsafe for SAFESEH image.
16>granny2.lib(granny2.dll) : error LNK2026: module unsafe for SAFESEH image.
16>granny2.lib(granny2.dll) : error LNK2026: module unsafe for SAFESEH image.
16>granny2.lib(granny2.dll) : error LNK2026: module unsafe for SAFESEH image.
16>granny2.lib(granny2.dll) : error LNK2026: module unsafe for SAFESEH image.
16>granny2.lib(granny2.dll) : error LNK2026: module unsafe for SAFESEH image.
16>granny2.lib(granny2.dll) : error LNK2026: module unsafe for SAFESEH image.
16>granny2.lib(granny2.dll) : error LNK2026: module unsafe for SAFESEH image.
16>granny2.lib(granny2.dll) : error LNK2026: module unsafe for SAFESEH image.
16>granny2.lib(granny2.dll) : error LNK2026: module unsafe for SAFESEH image.
16>granny2.lib(granny2.dll) : error LNK2026: module unsafe for SAFESEH image.
16>granny2.lib(granny2.dll) : error LNK2026: module unsafe for SAFESEH image.
16>granny2.lib(granny2.dll) : error LNK2026: module unsafe for SAFESEH image.
16>granny2.lib(granny2.dll) : error LNK2026: module unsafe for SAFESEH image.
16>granny2.lib(granny2.dll) : error LNK2026: module unsafe for SAFESEH image.
16>granny2.lib(granny2.dll) : error LNK2026: module unsafe for SAFESEH image.
16>granny2.lib(granny2.dll) : error LNK2026: module unsafe for SAFESEH image.
16>granny2.lib(granny2.dll) : error LNK2026: module unsafe for SAFESEH image.
16>granny2.lib(granny2.dll) : error LNK2026: module unsafe for SAFESEH image.
16>granny2.lib(granny2.dll) : error LNK2026: module unsafe for SAFESEH image.
16>granny2.lib(granny2.dll) : error LNK2026: module unsafe for SAFESEH image.
16>granny2.lib(granny2.dll) : error LNK2026: module unsafe for SAFESEH image.
16>granny2.lib(granny2.dll) : error LNK2026: module unsafe for SAFESEH image.
16>granny2.lib(granny2.dll) : error LNK2026: module unsafe for SAFESEH image.
16>granny2.lib(granny2.dll) : error LNK2026: module unsafe for SAFESEH image.
16>granny2.lib(granny2.dll) : error LNK2026: module unsafe for SAFESEH image.
16>mss32.lib(mss32.dll) : error LNK2026: module unsafe for SAFESEH image.
16>mss32.lib(mss32.dll) : error LNK2026: module unsafe for SAFESEH image.
16>mss32.lib(mss32.dll) : error LNK2026: module unsafe for SAFESEH image.
16>mss32.lib(mss32.dll) : error LNK2026: module unsafe for SAFESEH image.
16>mss32.lib(mss32.dll) : error LNK2026: module unsafe for SAFESEH image.
16>mss32.lib(mss32.dll) : error LNK2026: module unsafe for SAFESEH image.
16>mss32.lib(mss32.dll) : error LNK2026: module unsafe for SAFESEH image.
16>mss32.lib(mss32.dll) : error LNK2026: module unsafe for SAFESEH image.
16>mss32.lib(mss32.dll) : error LNK2026: module unsafe for SAFESEH image.
16>mss32.lib(mss32.dll) : error LNK2026: module unsafe for SAFESEH image.
16>mss32.lib(mss32.dll) : error LNK2026: module unsafe for SAFESEH image.
16>mss32.lib(mss32.dll) : error LNK2026: module unsafe for SAFESEH image.
16>mss32.lib(mss32.dll) : error LNK2026: module unsafe for SAFESEH image.
16>mss32.lib(mss32.dll) : error LNK2026: module unsafe for SAFESEH image.
16>mss32.lib(mss32.dll) : error LNK2026: module unsafe for SAFESEH image.
16>mss32.lib(mss32.dll) : error LNK2026: module unsafe for SAFESEH image.
16>mss32.lib(mss32.dll) : error LNK2026: module unsafe for SAFESEH image.
16>mss32.lib(mss32.dll) : error LNK2026: module unsafe for SAFESEH image.
16>mss32.lib(mss32.dll) : error LNK2026: module unsafe for SAFESEH image.
16>mss32.lib(mss32.dll) : error LNK2026: module unsafe for SAFESEH image.
16>mss32.lib(cleanup.obj) : error LNK2026: module unsafe for SAFESEH image.
16>mss32.lib(mss32.dll) : error LNK2026: module unsafe for SAFESEH image.
16>mss32.lib(mss32.dll) : error LNK2026: module unsafe for SAFESEH image.
16>mss32.lib(mss32.dll) : error LNK2026: module unsafe for SAFESEH image.
16>mss32.lib(mss32.dll) : error LNK2026: module unsafe for SAFESEH image.
16>mss32.lib(mss32.dll) : error LNK2026: module unsafe for SAFESEH image.
16>mss32.lib(mss32.dll) : error LNK2026: module unsafe for SAFESEH image.
16>mss32.lib(mss32.dll) : error LNK2026: module unsafe for SAFESEH image.
16>mss32.lib(mss32.dll) : error LNK2026: module unsafe for SAFESEH image.
16>mss32.lib(mss32.dll) : error LNK2026: module unsafe for SAFESEH image.
16>mss32.lib(mss32.dll) : error LNK2026: module unsafe for SAFESEH image.
16>mss32.lib(mss32.dll) : error LNK2026: module unsafe for SAFESEH image.
16>mss32.lib(mss32.dll) : error LNK2026: module unsafe for SAFESEH image.
16>mss32.lib(mss32.dll) : error LNK2026: module unsafe for SAFESEH image.
16>mss32.lib(mss32.dll) : error LNK2026: module unsafe for SAFESEH image.
16>mss32.lib(mss32.dll) : error LNK2026: module unsafe for SAFESEH image.
16>mss32.lib(mss32.dll) : error LNK2026: module unsafe for SAFESEH image.
16>mss32.lib(mss32.dll) : error LNK2026: module unsafe for SAFESEH image.
16>mss32.lib(mss32.dll) : error LNK2026: module unsafe for SAFESEH image.
16>mss32.lib(mss32.dll) : error LNK2026: module unsafe for SAFESEH image.
16>mss32.lib(mss32.dll) : error LNK2026: module unsafe for SAFESEH image.
16>mss32.lib(mss32.dll) : error LNK2026: module unsafe for SAFESEH image.
16>mss32.lib(mss32.dll) : error LNK2026: module unsafe for SAFESEH image.
16>mss32.lib(mss32.dll) : error LNK2026: module unsafe for SAFESEH image.
16>mss32.lib(mss32.dll) : error LNK2026: module unsafe for SAFESEH image.
16>mss32.lib(mss32.dll) : error LNK2026: module unsafe for SAFESEH image.
16>mss32.lib(mss32.dll) : error LNK2026: module unsafe for SAFESEH image.
16>mss32.lib(mss32.dll) : error LNK2026: module unsafe for SAFESEH image.
16>mss32.lib(mss32.dll) : error LNK2026: module unsafe for SAFESEH image.
16>mss32.lib(mss32.dll) : error LNK2026: module unsafe for SAFESEH image.
16>mss32.lib(mss32.dll) : error LNK2026: module unsafe for SAFESEH image.
16>mss32.lib(mss32.dll) : error LNK2026: module unsafe for SAFESEH image.
16>mss32.lib(mss32.dll) : error LNK2026: module unsafe for SAFESEH image.
16>mss32.lib(mss32.dll) : error LNK2026: module unsafe for SAFESEH image.
16>mss32.lib(mss32.dll) : error LNK2026: module unsafe for SAFESEH image.
16>dinput8.lib(dilib2.obj) : error LNK2026: module unsafe for SAFESEH image.
16> cryptlib-5.6.1MT.lib(cryptlib.obj) : MSIL .netmodule or module compiled with /GL found; restarting link with /LTCG; add /LTCG to the link command line to improve linker performance
16>LINK : warning LNK4075: ignoring '/INCREMENTAL' due to '/LTCG' specification
16>cryptlib-5.6.1MT.lib(cryptlib.obj) : error LNK2001: unresolved external symbol "public: static void __cdecl std::_String_base::_Xlen(void)" (?_Xlen@_String_base@std@@SAXXZ)
16>cryptlib-5.6.1MT.lib(cryptlib.obj) : error LNK2001: unresolved external symbol "public: static void __cdecl std::_String_base::_Xran(void)" (?_Xran@_String_base@std@@SAXXZ)
16>cryptlib-5.6.1MT.lib(gf2n.obj) : error LNK2001: unresolved external symbol "public: void __thiscall std::_Mutex::_Unlock(void)" (?_Unlock@_Mutex@std@@QAEXXZ)
16>cryptlib-5.6.1MT.lib(gf2n.obj) : error LNK2001: unresolved external symbol "public: void __thiscall std::_Mutex::_Lock(void)" (?_Lock@_Mutex@std@@QAEXXZ)
16>cryptlib-5.6.1MT.lib(integer.obj) : error LNK2001: unresolved external symbol "private: static void __cdecl std::locale::facet::facet_Register(class std::locale::facet *)" (?facet_Register@facet@locale@std@@CAXPAV123@@Z)
16>cryptlib-5.6.1MT.lib(integer.obj) : error LNK2001: unresolved external symbol "public: static void __cdecl std::_Locinfo::_Locinfo_ctor(class std::_Locinfo *,class std::basic_string<char,struct std::char_traits<char>,class std::allocator<char> > const &)" (?_Locinfo_ctor@_Locinfo@std@@SAXPAV12@ABV?$basic_string@DU?$char_traits@D@std@@V?$allocator@D@2@@2@@Z)
16>Distribute/metin2client.exe : fatal error LNK1120: 6 unresolved externals
========== Rebuild All: 15 succeeded, 1 failed, 0 skipped ==========



Poză:-
*Detalii suplimentare:Ma poate ajuta si pe mine ceineva? Nu pot compila Sursa Launcher ... primesc errorile astea, aveti idee de ce? :-\
Avatar utilizator
Pongo A.K.A Titan
Utilizator interzis !

Utilizator interzis !
Mesaje: 2028
Membru din: 01 Sep 2016, 16:08
Regat: Jinno
Aprecieri: 35  
Mulţumiri: 261  
 Contact:
Medalii

Ai incercat sa compilezi cu visual studio 2008 ?
 ! Mesaj de la: Pongo A.K.A Titan
Cand credeati ca am sa mor
M-am ridicat ca un invingator
Afișează semnătura
Avatar utilizator
HolyAngels
Nivel 2

Nivel 2
Mesaje: 154
Membru din: 11 Mai 2015, 16:10
Server: Metin2ROT
Regat: Jinno
Aprecieri: 215  
Mulţumiri: 5  
 Contact:
Medalii

Pongo A.K.A Titan scrie:Ai incercat sa compilezi cu visual studio 2008 ?

Da, dar imi da eroare cand vreu sa bag SLN-ul direct ...
Avatar utilizator
Asky
Ţepar / Untrusted User

Ţepar / Untrusted User
Mesaje: 1472
Membru din: 08 Oct 2014, 17:32
Regat: Chunjo
Aprecieri: 98  
Mulţumiri: 4811  
Discord: Copiază ID
 Contact:
Medalii

Autorul nu a mai dat nici un semn de mai bine de 3 zile . Subiect mutat în Arhivă!
Imagine
Afișează semnătura
Închis
Răspunsuri
7
Vizualizări
529
Răspunsuri
2
Vizualizări
176
Răspunsuri
17
Vizualizări
1810
Răspunsuri
14
Vizualizări
705

Înapoi la “Arhivă Probleme şi Întrebări”

  • Informaţie
  • Cine este conectat

    Utilizatori ce ce navighează pe acest forum: Niciun utilizator înregistrat și 26 vizitatori