[Compilat] BattleArena.cpp
[Compilat] FSM.cpp
[Compilat] MarkConvert.cpp
[Compilat] MarkImage.cpp
[Compilat] MarkManager.cpp
[Compilat] OXEvent.cpp
[Compilat] TrafficProfiler.cpp
[Compilat] ani.cpp
[Compilat] arena.cpp
[Compilat] banword.cpp
[Compilat] battle.cpp
[Compilat] block_country.cpp
[Compilat] buffer_manager.cpp
[Compilat] building.cpp
[Compilat] castle.cpp
[Compilat] char.cpp
[Compilat] char_affect.cpp
[Compilat] char_battle.cpp
[Compilat] char_change_empire.cpp
[Compilat] blend_item.cpp
In file included from stdafx.h:39,
from banword.cpp:1:
event.h:10:35: error: boost/intrusive_ptr.hpp: No such file or directory
In file included from banword.cpp:3:
banword.h:5:35: error: boost/unordered_map.hpp: No such file or directory
In file included from stdafx.h:39,
from arena.cpp:1:
event.h:10:35: error: boost/intrusive_ptr.hpp: No such file or directory
In file included from desc.h:7,
from arena.cpp:5:
cipher.h:6:31: error: cryptopp/cryptlib.h: No such file or directory
In file included from arena.cpp:8:
questmanager.h:4:35: error: boost/unordered_map.hpp: No such file or directory
In file included from stdafx.h:39,
from ani.cpp:10:
event.h:10:35: error: boost/intrusive_ptr.hpp: No such file or directory
In file included from ani.cpp:11:
char.h:4:35: error: boost/unordered_map.hpp: No such file or directory
In file included from stdafx.h:39,
from TrafficProfiler.cpp:10:
event.h:10:35: error: boost/intrusive_ptr.hpp: No such file or directory
In file included from stdafx.h:39,
from OXEvent.cpp:1:
event.h:10:35: error: boost/intrusive_ptr.hpp: No such file or directory
In file included from OXEvent.cpp:4:
questmanager.h:4:35: error: boost/unordered_map.hpp: No such file or directory
In file included from desc.h:7,
from OXEvent.cpp:12:
cipher.h:6:31: error: cryptopp/cryptlib.h: No such file or directory
In file included from stdafx.h:39,
from MarkManager.cpp:1:
event.h:10:35: error: boost/intrusive_ptr.hpp: No such file or directory
In file included from stdafx.h:39,
from MarkConvert.cpp:1:
event.h:10:35: error: boost/intrusive_ptr.hpp: No such file or directory
In file included from stdafx.h:39,
from BattleArena.cpp:1:
event.h:10:35: error: boost/intrusive_ptr.hpp: No such file or directory
In file included from BattleArena.cpp:6:
char.h:4:35: error: boost/unordered_map.hpp: No such file or directory
In file included from stdafx.h:39,
from battle.cpp:1:
event.h:10:35: error: boost/intrusive_ptr.hpp: No such file or directory
In file included from desc.h:7,
from battle.cpp:4:
cipher.h:6:31: error: cryptopp/cryptlib.h: No such file or directory
In file included from battle.cpp:5:
char.h:4:35: error: boost/unordered_map.hpp: No such file or directory
In file included from stdafx.h:39,
from block_country.cpp:10:
event.h:10:35: error: boost/intrusive_ptr.hpp: No such file or directory
In file included from stdafx.h:39,
from buffer_manager.cpp:1:
event.h:10:35: error: boost/intrusive_ptr.hpp: No such file or directory
In file included from stdafx.h:39,
from building.cpp:1:
event.h:10:35: error: boost/intrusive_ptr.hpp: No such file or directory
In file included from building.cpp:8:
char.h:4:35: error: boost/unordered_map.hpp: No such file or directory
In file included from desc.h:7,
from building.cpp:12:
cipher.h:6:31: error: cryptopp/cryptlib.h: No such file or directory
In file included from stdafx.h:39,
from castle.cpp:12:
event.h:10:35: error: boost/intrusive_ptr.hpp: No such file or directory
In file included from castle.cpp:21:
char.h:4:35: error: boost/unordered_map.hpp: No such file or directory
In file included from stdafx.h:39,
from char.cpp:1:
event.h:10:35: error: boost/intrusive_ptr.hpp: No such file or directory
In file included from char.cpp:6:
char.h:4:35: error: boost/unordered_map.hpp: No such file or directory
In file included from desc.h:7,
from desc_client.h:4,
from char.cpp:12:
cipher.h:6:31: error: cryptopp/cryptlib.h: No such file or directory
In file included from stdafx.h:39,
from char_affect.cpp:2:
event.h:10:35: error: boost/intrusive_ptr.hpp: No such file or directory
In file included from char_affect.cpp:5:
char.h:4:35: error: boost/unordered_map.hpp: No such file or directory
In file included from desc.h:7,
from desc_client.h:4,
from char_affect.cpp:10:
cipher.h:6:31: error: cryptopp/cryptlib.h: No such file or directory
In file included from stdafx.h:39,
from char_battle.cpp:1:
event.h:10:35: error: boost/intrusive_ptr.hpp: No such file or directory
In file included from desc.h:7,
from char_battle.cpp:4:
cipher.h:6:31: error: cryptopp/cryptlib.h: No such file or directory
In file included from char_battle.cpp:5:
desc_manager.h:4:35: error: boost/unordered_map.hpp: No such file or directory
In file included from stdafx.h:39,
from char_change_empire.cpp:2:
event.h:10:35: error: boost/intrusive_ptr.hpp: No such file or directory
In file included from char_change_empire.cpp:4:
char.h:4:35: error: boost/unordered_map.hpp: No such file or directory
In file included from stdafx.h:39,
from MarkImage.cpp:1:
event.h:10:35: error: boost/intrusive_ptr.hpp: No such file or directory
In file included from stdafx.h:39,
from char_battle.cpp:1:
event.h:37: error: 'boost' has not been declared
event.h:37: error: expected initializer before '<' token
event.h:38: error: typedef 'TEVENTFUNC' is initialized (use __typeof__ instead)
event.h:38: error: 'LPEVENT' was not declared in this scope
event.h:38: error: expected primary-expression before 'long'
event.h:57: error: 'TEVENTFUNC' does not name a type
event.h: In constructor 'event::event()':
event.h:47: error: class 'event' does not have any field named 'func'
event.h: At global scope:
event.h:83: error: 'LPEVENT' does not name a type
In file included from stdafx.h:39,
from MarkImage.cpp:1:
event.h:37: error: 'boost' has not been declared
event.h:37: error: expected initializer before '<' token
event.h:38: error: typedef 'TEVENTFUNC' is initialized (use __typeof__ instead)
event.h:38: error: 'LPEVENT' was not declared in this scope
event.h:38: error: expected primary-expression before 'long'
event.h:57: error: 'TEVENTFUNC' does not name a type
event.h: In constructor 'event::event()':
event.h:47: error: class 'event' does not have any field named 'func'
event.h: At global scope:
event.h:83: error: 'LPEVENT' does not name a type
In file included from stdafx.h:39,
from char_change_empire.cpp:2:
[Compilat] FSM.cpp
[Compilat] MarkConvert.cpp
[Compilat] MarkImage.cpp
[Compilat] MarkManager.cpp
[Compilat] OXEvent.cpp
[Compilat] TrafficProfiler.cpp
[Compilat] ani.cpp
[Compilat] arena.cpp
[Compilat] banword.cpp
[Compilat] battle.cpp
[Compilat] block_country.cpp
[Compilat] buffer_manager.cpp
[Compilat] building.cpp
[Compilat] castle.cpp
[Compilat] char.cpp
[Compilat] char_affect.cpp
[Compilat] char_battle.cpp
[Compilat] char_change_empire.cpp
[Compilat] blend_item.cpp
In file included from stdafx.h:39,
from banword.cpp:1:
event.h:10:35: error: boost/intrusive_ptr.hpp: No such file or directory
In file included from banword.cpp:3:
banword.h:5:35: error: boost/unordered_map.hpp: No such file or directory
In file included from stdafx.h:39,
from arena.cpp:1:
event.h:10:35: error: boost/intrusive_ptr.hpp: No such file or directory
In file included from desc.h:7,
from arena.cpp:5:
cipher.h:6:31: error: cryptopp/cryptlib.h: No such file or directory
In file included from arena.cpp:8:
questmanager.h:4:35: error: boost/unordered_map.hpp: No such file or directory
In file included from stdafx.h:39,
from ani.cpp:10:
event.h:10:35: error: boost/intrusive_ptr.hpp: No such file or directory
In file included from ani.cpp:11:
char.h:4:35: error: boost/unordered_map.hpp: No such file or directory
In file included from stdafx.h:39,
from TrafficProfiler.cpp:10:
event.h:10:35: error: boost/intrusive_ptr.hpp: No such file or directory
In file included from stdafx.h:39,
from OXEvent.cpp:1:
event.h:10:35: error: boost/intrusive_ptr.hpp: No such file or directory
In file included from OXEvent.cpp:4:
questmanager.h:4:35: error: boost/unordered_map.hpp: No such file or directory
In file included from desc.h:7,
from OXEvent.cpp:12:
cipher.h:6:31: error: cryptopp/cryptlib.h: No such file or directory
In file included from stdafx.h:39,
from MarkManager.cpp:1:
event.h:10:35: error: boost/intrusive_ptr.hpp: No such file or directory
In file included from stdafx.h:39,
from MarkConvert.cpp:1:
event.h:10:35: error: boost/intrusive_ptr.hpp: No such file or directory
In file included from stdafx.h:39,
from BattleArena.cpp:1:
event.h:10:35: error: boost/intrusive_ptr.hpp: No such file or directory
In file included from BattleArena.cpp:6:
char.h:4:35: error: boost/unordered_map.hpp: No such file or directory
In file included from stdafx.h:39,
from battle.cpp:1:
event.h:10:35: error: boost/intrusive_ptr.hpp: No such file or directory
In file included from desc.h:7,
from battle.cpp:4:
cipher.h:6:31: error: cryptopp/cryptlib.h: No such file or directory
In file included from battle.cpp:5:
char.h:4:35: error: boost/unordered_map.hpp: No such file or directory
In file included from stdafx.h:39,
from block_country.cpp:10:
event.h:10:35: error: boost/intrusive_ptr.hpp: No such file or directory
In file included from stdafx.h:39,
from buffer_manager.cpp:1:
event.h:10:35: error: boost/intrusive_ptr.hpp: No such file or directory
In file included from stdafx.h:39,
from building.cpp:1:
event.h:10:35: error: boost/intrusive_ptr.hpp: No such file or directory
In file included from building.cpp:8:
char.h:4:35: error: boost/unordered_map.hpp: No such file or directory
In file included from desc.h:7,
from building.cpp:12:
cipher.h:6:31: error: cryptopp/cryptlib.h: No such file or directory
In file included from stdafx.h:39,
from castle.cpp:12:
event.h:10:35: error: boost/intrusive_ptr.hpp: No such file or directory
In file included from castle.cpp:21:
char.h:4:35: error: boost/unordered_map.hpp: No such file or directory
In file included from stdafx.h:39,
from char.cpp:1:
event.h:10:35: error: boost/intrusive_ptr.hpp: No such file or directory
In file included from char.cpp:6:
char.h:4:35: error: boost/unordered_map.hpp: No such file or directory
In file included from desc.h:7,
from desc_client.h:4,
from char.cpp:12:
cipher.h:6:31: error: cryptopp/cryptlib.h: No such file or directory
In file included from stdafx.h:39,
from char_affect.cpp:2:
event.h:10:35: error: boost/intrusive_ptr.hpp: No such file or directory
In file included from char_affect.cpp:5:
char.h:4:35: error: boost/unordered_map.hpp: No such file or directory
In file included from desc.h:7,
from desc_client.h:4,
from char_affect.cpp:10:
cipher.h:6:31: error: cryptopp/cryptlib.h: No such file or directory
In file included from stdafx.h:39,
from char_battle.cpp:1:
event.h:10:35: error: boost/intrusive_ptr.hpp: No such file or directory
In file included from desc.h:7,
from char_battle.cpp:4:
cipher.h:6:31: error: cryptopp/cryptlib.h: No such file or directory
In file included from char_battle.cpp:5:
desc_manager.h:4:35: error: boost/unordered_map.hpp: No such file or directory
In file included from stdafx.h:39,
from char_change_empire.cpp:2:
event.h:10:35: error: boost/intrusive_ptr.hpp: No such file or directory
In file included from char_change_empire.cpp:4:
char.h:4:35: error: boost/unordered_map.hpp: No such file or directory
In file included from stdafx.h:39,
from MarkImage.cpp:1:
event.h:10:35: error: boost/intrusive_ptr.hpp: No such file or directory
In file included from stdafx.h:39,
from char_battle.cpp:1:
event.h:37: error: 'boost' has not been declared
event.h:37: error: expected initializer before '<' token
event.h:38: error: typedef 'TEVENTFUNC' is initialized (use __typeof__ instead)
event.h:38: error: 'LPEVENT' was not declared in this scope
event.h:38: error: expected primary-expression before 'long'
event.h:57: error: 'TEVENTFUNC' does not name a type
event.h: In constructor 'event::event()':
event.h:47: error: class 'event' does not have any field named 'func'
event.h: At global scope:
event.h:83: error: 'LPEVENT' does not name a type
In file included from stdafx.h:39,
from MarkImage.cpp:1:
event.h:37: error: 'boost' has not been declared
event.h:37: error: expected initializer before '<' token
event.h:38: error: typedef 'TEVENTFUNC' is initialized (use __typeof__ instead)
event.h:38: error: 'LPEVENT' was not declared in this scope
event.h:38: error: expected primary-expression before 'long'
event.h:57: error: 'TEVENTFUNC' does not name a type
event.h: In constructor 'event::event()':
event.h:47: error: class 'event' does not have any field named 'func'
event.h: At global scope:
event.h:83: error: 'LPEVENT' does not name a type
In file included from stdafx.h:39,
from char_change_empire.cpp:2:
[OK] Config.cpp
[OK] NetBase.cpp
[OK] Peer.cpp
[OK] PeerBase.cpp
[OK] Main.cpp
[OK] Lock.cpp
[OK] DBManager.cpp
[OK] Cache.cpp
[OK] LoginData.cpp
[OK] ClientManager.cpp
[OK] ClientManagerPlayer.cpp
[OK] ClientManagerLogin.cpp
[OK] ClientManagerBoot.cpp
[OK] ClientManagerParty.cpp
[OK] ClientManagerGuild.cpp
[OK] GuildManager.cpp
[OK] HB.cpp
[OK] PrivManager.cpp
[OK] MoneyLog.cpp
[OK] ItemAwardManager.cpp
In file included from NetBase.cpp:4:
ClientManager.h:5:35: error: boost/unordered_map.hpp: No such file or directory
ClientManager.h:6:35: error: boost/unordered_set.hpp: No such file or directory
In file included from Main.cpp:5:
ClientManager.h:5:35: error: boost/unordered_map.hpp: No such file or directory
ClientManager.h:6:35: error: boost/unordered_set.hpp: No such file or directory
In file included from DBManager.cpp:3:
ClientManager.h:5:35: error: boost/unordered_map.hpp: No such file or directory
ClientManager.h:6:35: error: boost/unordered_set.hpp: No such file or directory
In file included from Cache.cpp:6:
ClientManager.h:5:35: error: boost/unordered_map.hpp: No such file or directory
ClientManager.h:6:35: error: boost/unordered_set.hpp: No such file or directory
In file included from LoginData.cpp:3:
ClientManager.h:5:35: error: boost/unordered_map.hpp: No such file or directory
ClientManager.h:6:35: error: boost/unordered_set.hpp: No such file or directory
In file included from Main.cpp:5:
ClientManager.h:35: error: 'boost' has not been declared
ClientManager.h:35: error: ISO C++ forbids declaration of 'unordered_map' with no type
ClientManager.h:35: error: typedef name may not be a nested-name-specifier
ClientManager.h:35: error: expected ';' before '<' token
ClientManager.h:36: error: 'boost' has not been declared
ClientManager.h:36: error: ISO C++ forbids declaration of 'unordered_map' with no type
ClientManager.h:36: error: typedef name may not be a nested-name-specifier
ClientManager.h:36: error: expected ';' before '<' token
ClientManager.h:37: error: 'boost' has not been declared
ClientManager.h:37: error: ISO C++ forbids declaration of 'unordered_set' with no type
ClientManager.h:37: error: typedef name may not be a nested-name-specifier
ClientManager.h:37: error: expected ';' before '<' token
ClientManager.h:38: error: 'boost' has not been declared
ClientManager.h:38: error: ISO C++ forbids declaration of 'unordered_map' with no type
ClientManager.h:38: error: typedef name may not be a nested-name-specifier
ClientManager.h:38: error: expected ';' before '<' token
ClientManager.h:39: error: 'boost' has not been declared
ClientManager.h:39: error: ISO C++ forbids declaration of 'unordered_map' with no type
ClientManager.h:39: error: typedef name may not be a nested-name-specifier
ClientManager.h:39: error: expected ';' before '<' token
ClientManager.h:40: error: 'boost' has not been declared
ClientManager.h:40: error: ISO C++ forbids declaration of 'unordered_map' with no type
ClientManager.h:40: error: typedef name may not be a nested-name-specifier
ClientManager.h:40: error: expected ';' before '<' token
In file included from NetBase.cpp:4:
ClientManager.h:35: error: 'boost' has not been declared
ClientManager.h:35: error: ISO C++ forbids declaration of 'unordered_map' with no type
ClientManager.h:35: error: typedef name may not be a nested-name-specifier
ClientManager.h:35: error: expected ';' before '<' token
ClientManager.h:36: error: 'boost' has not been declared
ClientManager.h:36: error: ISO C++ forbids declaration of 'unordered_map' with no type
ClientManager.h:36: error: typedef name may not be a nested-name-specifier
ClientManager.h:36: error: expected ';' before '<' token
ClientManager.h:37: error: 'boost' has not been declared
ClientManager.h:37: error: ISO C++ forbids declaration of 'unordered_set' with no type
ClientManager.h:37: error: typedef name may not be a nested-name-specifier
ClientManager.h:37: error: expected ';' before '<' token
ClientManager.h:38: error: 'boost' has not been declared
ClientManager.h:38: error: ISO C++ forbids declaration of 'unordered_map' with no type
ClientManager.h:38: error: typedef name may not be a nested-name-specifier
ClientManager.h:38: error: expected ';' before '<' token
ClientManager.h:39: error: 'boost' has not been declared
ClientManager.h:39: error: ISO C++ forbids declaration of 'unordered_map' with no type
ClientManager.h:39: error: typedef name may not be a nested-name-specifier
ClientManager.h:39: error: expected ';' before '<' token
ClientManager.h:40: error: 'boost' has not been declared
ClientManager.h:40: error: ISO C++ forbids declaration of 'unordered_map' with no type
ClientManager.h:40: error: typedef name may not be a nested-name-specifier
ClientManager.h:40: error: expected ';' before '<' token
ClientManager.h:120: error: ISO C++ forbids declaration of 'TItemCacheSet' with no type
ClientManager.h:120: error: expected ';' before '*' token
ClientManager.h:395: error: 'boost' has not been declared
ClientManager.h:395: error: ISO C++ forbids declaration of 'unordered_map' with no type
ClientManager.h:395: error: typedef name may not be a nested-name-specifier
ClientManager.h:395: error: expected ';' before '<' token
ClientManager.h:396: error: 'TLoginDataByLoginKey' does not name a type
ClientManager.h:399: error: 'boost' has not been declared
ClientManager.h:399: error: ISO C++ forbids declaration of 'unordered_map' with no type
ClientManager.h:399: error: typedef name may not be a nested-name-specifier
ClientManager.h:399: error: expected ';' before '<' token
ClientManager.h:400: error: 'TLoginDataByLogin' does not name a type
ClientManager.h:403: error: 'boost' has not been declared
ClientManager.h:403: error: ISO C++ forbids declaration of 'unordered_map' with no type
ClientManager.h:403: error: typedef name may not be a nested-name-specifier
ClientManager.h:403: error: expected ';' before '<' token
ClientManager.h:404: error: 'TLoginDataByAID' does not name a type
ClientManager.h:407: error: 'boost' has not been declared
ClientManager.h:407: error: ISO C++ forbids declaration of 'unordered_map' with no type
ClientManager.h:407: error: typedef name may not be a nested-name-specifier
ClientManager.h:407: error: expected ';' before '<' token
ClientManager.h:408: error: 'TLogonAccountMap' does not name a type
ClientManager.h:438: error: 'TPlayerTableCacheMap' does not name a type
ClientManager.h:440: error: 'TItemCacheMap' does not name a type
ClientManager.h:441: error: 'TItemCacheSetPtrMap' does not name a type
ClientManager.h:445: error: 'TItemPriceListCacheMap' does not name a type
ClientManager.h:448: error: 'TChannelStatusMap' does not name a type
ClientManager.h:513: error: 'boost' has not been declared
ClientManager.h:513: error: ISO C++ forbids declaration of 'unordered_map' with no type
ClientManager.h:513: error: typedef name may not be a nested-name-specifier
ClientManager.h:513: error: expected ';' before '<' token
ClientManager.h:514: error: 'TLogoutPlayerMap' does not name a type
Makefile:54: recipe for target '.obj/NetBase.o' failed
gmake: *** [.obj/NetBase.o] Error 1
gmake: *** Waiting for unfinished jobs....
In file included from ClientManager.cpp:9:
ClientManager.h:5:35: error: boost/unordered_map.hpp: No such file or directory
ClientManager.h:6:35: error: boost/unordered_set.hpp: No such file or directory
In file included from ClientManagerPlayer.cpp:4:
ClientManager.h:5:35: error: boost/unordered_map.hpp: No such file or directory
ClientManager.h:6:35: error: boost/unordered_set.hpp: No such file or directory
In file included from ClientManagerLogin.cpp:4:
ClientManager.h:5:35: error: boost/unordered_map.hpp: No such file or directory
ClientManager.h:6:35: error: boost/unordered_set.hpp: No such file or directory
In file included from ClientManagerBoot.cpp:4:
ClientManager.h:5:35: error: boost/unordered_map.hpp: No such file or directory
ClientManager.h:6:35: error: boost/unordered_set.hpp: No such file or directory
In file included from ClientManagerParty.cpp:3:
ClientManager.h:5:35: error: boost/unordered_map.hpp: No such file or directory
ClientManager.h:6:35: error: boost/unordered_set.hpp: No such file or directory
In file included from ClientManagerGuild.cpp:3:
ClientManager.h:5:35: error: boost/unordered_map.hpp: No such file or directory
ClientManager.h:6:35: error: boost/unordered_set.hpp: No such file or directory
In file included from GuildManager.cpp:4:
ClientManager.h:5:35: error: boost/unordered_map.hpp: No such file or directory
ClientManager.h:6:35: error: boost/unordered_set.hpp: No such file or directory
In file included from PrivManager.cpp:3:
ClientManager.h:5:35: error: boost/unordered_map.hpp: No such file or directory
ClientManager.h:6:35: error: boost/unordered_set.hpp: No such file or directory
In file included from MoneyLog.cpp:3:
ClientManager.h:5:35: error: boost/unordered_map.hpp: No such file or directory
ClientManager.h:6:35: error: boost/unordered_set.hpp: No such file or directory
In file included from ItemAwardManager.cpp:7:
ClientManager.h:5:35: error: boost/unordered_map.hpp: No such file or directory
ClientManager.h:6:35: error: boost/unordered_set.hpp: No such file or directory
In file included from DBManager.cpp:3:
ClientManager.h:35: error: 'boost' has not been declared
ClientManager.h:35: error: ISO C++ forbids declaration of 'unordered_map' with no type
ClientManager.h:35: error: typedef name may not be a nested-name-specifier
ClientManager.h:35: error: expected ';' before '<' token
ClientManager.h:36: error: 'boost' has not been declared
ClientManager.h:36: error: ISO C++ forbids declaration of 'unordered_map' with no type
ClientManager.h:36: error: typedef name may not be a nested-name-specifier
ClientManager.h:36: error: expected ';' before '<' token
ClientManager.h:37: error: 'boost' has not been declared
ClientManager.h:37: error: ISO C++ forbids declaration of 'unordered_set' with no type
ClientManager.h:37: error: typedef name may not be a nested-name-specifier
ClientManager.h:37: error: expected ';' before '<' token
ClientManager.h:38: error: 'boost' has not been declared
ClientManager.h:38: error: ISO C++ forbids declaration of 'unordered_map' with no type
ClientManager.h:38: error: typedef name may not be a nested-name-specifier
ClientManager.h:38: error: expected ';' before '<' token
ClientManager.h:39: error: 'boost' has not been declared
ClientManager.h:39: error: ISO C++ forbids declaration of 'unordered_map' with no type
ClientManager.h:39: error: typedef name may not be a nested-name-specifier
ClientManager.h:39: error: expected ';' before '<' token
ClientManager.h:40: error: 'boost' has not been declared
ClientManager.h:40: error: ISO C++ forbids declaration of 'unordered_map' with no type
ClientManager.h:40: error: typedef name may not be a nested-name-specifier
ClientManager.h:40: error: expected ';' before '<' token
ClientManager.h:120: error: ISO C++ forbids declaration of 'TItemCacheSet' with no type
ClientManager.h:120: error: expected ';' before '*' token
ClientManager.h:395: error: 'boost' has not been declared
ClientManager.h:395: error: ISO C++ forbids declaration of 'unordered_map' with no type
ClientManager.h:395: error: typedef name may not be a nested-name-specifier
ClientManager.h:395: error: expected ';' before '<' token
ClientManager.h:396: error: 'TLoginDataByLoginKey' does not name a type
ClientManager.h:399: error: 'boost' has not been declared
ClientManager.h:399: error: ISO C++ forbids declaration of 'unordered_map' with no type
ClientManager.h:399: error: typedef name may not be a nested-name-specifier
ClientManager.h:399: error: expected ';' before '<' token
ClientManager.h:400: error: 'TLoginDataByLogin' does not name a type
ClientManager.h:403: error: 'boost' has not been declared
ClientManager.h:403: error: ISO C++ forbids declaration of 'unordered_map' with no type
ClientManager.h:403: error: typedef name may not be a nested-name-specifier
ClientManager.h:403: error: expected ';' before '<' token
ClientManager.h:404: error: 'TLoginDataByAID' does not name a type
ClientManager.h:407: error: 'boost' has not been declared
ClientManager.h:407: error: ISO C++ forbids declaration of 'unordered_map' with no type
ClientManager.h:407: error: typedef name may not be a nested-name-specifier
ClientManager.h:407: error: expected ';' before '<' token
ClientManager.h:408: error: 'TLogonAccountMap' does not name a type
ClientManager.h:438: error: 'TPlayerTableCacheMap' does not name a type
ClientManager.h:440: error: 'TItemCacheMap' does not name a type
ClientManager.h:441: error: 'TItemCacheSetPtrMap' does not name a type
ClientManager.h:445: error: 'TItemPriceListCacheMap' does not name a type
ClientManager.h:448: error: 'TChannelStatusMap' does not name a type
ClientManager.h:513: error: 'boost' has not been declared
ClientManager.h:513: error: ISO C++ forbids declaration of 'unordered_map' with no type
ClientManager.h:513: error: typedef name may not be a nested-name-specifier
ClientManager.h:513: error: expected ';' before '<' token
ClientManager.h:514: error: 'TLogoutPlayerMap' does not name a type
In file included from Cache.cpp:6:
ClientManager.h:35: error: 'boost' has not been declared
ClientManager.h:35: error: ISO C++ forbids declaration of 'unordered_map' with no type
ClientManager.h:35: error: typedef name may not be a nested-name-specifier
ClientManager.h:35: error: expected ';' before '<' token
ClientManager.h:36: error: 'boost' has not been declared
ClientManager.h:36: error: ISO C++ forbids declaration of 'unordered_map' with no type
ClientManager.h:36: error: typedef name may not be a nested-name-specifier
ClientManager.h:36: error: expected ';' before '<' token
ClientManager.h:37: error: 'boost' has not been declared
ClientManager.h:37: error: ISO C++ forbids declaration of 'unordered_set' with no type
ClientManager.h:37: error: typedef name may not be a nested-name-specifier
ClientManager.h:37: error: expected ';' before '<' token
ClientManager.h:38: error: 'boost' has not been declared
ClientManager.h:38: error: ISO C++ forbids declaration of 'unordered_map' with no type
ClientManager.h:38: error: typedef name may not be a nested-name-specifier
ClientManager.h:38: error: expected ';' before '<' token
ClientManager.h:39: error: 'boost' has not been declared
[OK] NetBase.cpp
[OK] Peer.cpp
[OK] PeerBase.cpp
[OK] Main.cpp
[OK] Lock.cpp
[OK] DBManager.cpp
[OK] Cache.cpp
[OK] LoginData.cpp
[OK] ClientManager.cpp
[OK] ClientManagerPlayer.cpp
[OK] ClientManagerLogin.cpp
[OK] ClientManagerBoot.cpp
[OK] ClientManagerParty.cpp
[OK] ClientManagerGuild.cpp
[OK] GuildManager.cpp
[OK] HB.cpp
[OK] PrivManager.cpp
[OK] MoneyLog.cpp
[OK] ItemAwardManager.cpp
In file included from NetBase.cpp:4:
ClientManager.h:5:35: error: boost/unordered_map.hpp: No such file or directory
ClientManager.h:6:35: error: boost/unordered_set.hpp: No such file or directory
In file included from Main.cpp:5:
ClientManager.h:5:35: error: boost/unordered_map.hpp: No such file or directory
ClientManager.h:6:35: error: boost/unordered_set.hpp: No such file or directory
In file included from DBManager.cpp:3:
ClientManager.h:5:35: error: boost/unordered_map.hpp: No such file or directory
ClientManager.h:6:35: error: boost/unordered_set.hpp: No such file or directory
In file included from Cache.cpp:6:
ClientManager.h:5:35: error: boost/unordered_map.hpp: No such file or directory
ClientManager.h:6:35: error: boost/unordered_set.hpp: No such file or directory
In file included from LoginData.cpp:3:
ClientManager.h:5:35: error: boost/unordered_map.hpp: No such file or directory
ClientManager.h:6:35: error: boost/unordered_set.hpp: No such file or directory
In file included from Main.cpp:5:
ClientManager.h:35: error: 'boost' has not been declared
ClientManager.h:35: error: ISO C++ forbids declaration of 'unordered_map' with no type
ClientManager.h:35: error: typedef name may not be a nested-name-specifier
ClientManager.h:35: error: expected ';' before '<' token
ClientManager.h:36: error: 'boost' has not been declared
ClientManager.h:36: error: ISO C++ forbids declaration of 'unordered_map' with no type
ClientManager.h:36: error: typedef name may not be a nested-name-specifier
ClientManager.h:36: error: expected ';' before '<' token
ClientManager.h:37: error: 'boost' has not been declared
ClientManager.h:37: error: ISO C++ forbids declaration of 'unordered_set' with no type
ClientManager.h:37: error: typedef name may not be a nested-name-specifier
ClientManager.h:37: error: expected ';' before '<' token
ClientManager.h:38: error: 'boost' has not been declared
ClientManager.h:38: error: ISO C++ forbids declaration of 'unordered_map' with no type
ClientManager.h:38: error: typedef name may not be a nested-name-specifier
ClientManager.h:38: error: expected ';' before '<' token
ClientManager.h:39: error: 'boost' has not been declared
ClientManager.h:39: error: ISO C++ forbids declaration of 'unordered_map' with no type
ClientManager.h:39: error: typedef name may not be a nested-name-specifier
ClientManager.h:39: error: expected ';' before '<' token
ClientManager.h:40: error: 'boost' has not been declared
ClientManager.h:40: error: ISO C++ forbids declaration of 'unordered_map' with no type
ClientManager.h:40: error: typedef name may not be a nested-name-specifier
ClientManager.h:40: error: expected ';' before '<' token
In file included from NetBase.cpp:4:
ClientManager.h:35: error: 'boost' has not been declared
ClientManager.h:35: error: ISO C++ forbids declaration of 'unordered_map' with no type
ClientManager.h:35: error: typedef name may not be a nested-name-specifier
ClientManager.h:35: error: expected ';' before '<' token
ClientManager.h:36: error: 'boost' has not been declared
ClientManager.h:36: error: ISO C++ forbids declaration of 'unordered_map' with no type
ClientManager.h:36: error: typedef name may not be a nested-name-specifier
ClientManager.h:36: error: expected ';' before '<' token
ClientManager.h:37: error: 'boost' has not been declared
ClientManager.h:37: error: ISO C++ forbids declaration of 'unordered_set' with no type
ClientManager.h:37: error: typedef name may not be a nested-name-specifier
ClientManager.h:37: error: expected ';' before '<' token
ClientManager.h:38: error: 'boost' has not been declared
ClientManager.h:38: error: ISO C++ forbids declaration of 'unordered_map' with no type
ClientManager.h:38: error: typedef name may not be a nested-name-specifier
ClientManager.h:38: error: expected ';' before '<' token
ClientManager.h:39: error: 'boost' has not been declared
ClientManager.h:39: error: ISO C++ forbids declaration of 'unordered_map' with no type
ClientManager.h:39: error: typedef name may not be a nested-name-specifier
ClientManager.h:39: error: expected ';' before '<' token
ClientManager.h:40: error: 'boost' has not been declared
ClientManager.h:40: error: ISO C++ forbids declaration of 'unordered_map' with no type
ClientManager.h:40: error: typedef name may not be a nested-name-specifier
ClientManager.h:40: error: expected ';' before '<' token
ClientManager.h:120: error: ISO C++ forbids declaration of 'TItemCacheSet' with no type
ClientManager.h:120: error: expected ';' before '*' token
ClientManager.h:395: error: 'boost' has not been declared
ClientManager.h:395: error: ISO C++ forbids declaration of 'unordered_map' with no type
ClientManager.h:395: error: typedef name may not be a nested-name-specifier
ClientManager.h:395: error: expected ';' before '<' token
ClientManager.h:396: error: 'TLoginDataByLoginKey' does not name a type
ClientManager.h:399: error: 'boost' has not been declared
ClientManager.h:399: error: ISO C++ forbids declaration of 'unordered_map' with no type
ClientManager.h:399: error: typedef name may not be a nested-name-specifier
ClientManager.h:399: error: expected ';' before '<' token
ClientManager.h:400: error: 'TLoginDataByLogin' does not name a type
ClientManager.h:403: error: 'boost' has not been declared
ClientManager.h:403: error: ISO C++ forbids declaration of 'unordered_map' with no type
ClientManager.h:403: error: typedef name may not be a nested-name-specifier
ClientManager.h:403: error: expected ';' before '<' token
ClientManager.h:404: error: 'TLoginDataByAID' does not name a type
ClientManager.h:407: error: 'boost' has not been declared
ClientManager.h:407: error: ISO C++ forbids declaration of 'unordered_map' with no type
ClientManager.h:407: error: typedef name may not be a nested-name-specifier
ClientManager.h:407: error: expected ';' before '<' token
ClientManager.h:408: error: 'TLogonAccountMap' does not name a type
ClientManager.h:438: error: 'TPlayerTableCacheMap' does not name a type
ClientManager.h:440: error: 'TItemCacheMap' does not name a type
ClientManager.h:441: error: 'TItemCacheSetPtrMap' does not name a type
ClientManager.h:445: error: 'TItemPriceListCacheMap' does not name a type
ClientManager.h:448: error: 'TChannelStatusMap' does not name a type
ClientManager.h:513: error: 'boost' has not been declared
ClientManager.h:513: error: ISO C++ forbids declaration of 'unordered_map' with no type
ClientManager.h:513: error: typedef name may not be a nested-name-specifier
ClientManager.h:513: error: expected ';' before '<' token
ClientManager.h:514: error: 'TLogoutPlayerMap' does not name a type
Makefile:54: recipe for target '.obj/NetBase.o' failed
gmake: *** [.obj/NetBase.o] Error 1
gmake: *** Waiting for unfinished jobs....
In file included from ClientManager.cpp:9:
ClientManager.h:5:35: error: boost/unordered_map.hpp: No such file or directory
ClientManager.h:6:35: error: boost/unordered_set.hpp: No such file or directory
In file included from ClientManagerPlayer.cpp:4:
ClientManager.h:5:35: error: boost/unordered_map.hpp: No such file or directory
ClientManager.h:6:35: error: boost/unordered_set.hpp: No such file or directory
In file included from ClientManagerLogin.cpp:4:
ClientManager.h:5:35: error: boost/unordered_map.hpp: No such file or directory
ClientManager.h:6:35: error: boost/unordered_set.hpp: No such file or directory
In file included from ClientManagerBoot.cpp:4:
ClientManager.h:5:35: error: boost/unordered_map.hpp: No such file or directory
ClientManager.h:6:35: error: boost/unordered_set.hpp: No such file or directory
In file included from ClientManagerParty.cpp:3:
ClientManager.h:5:35: error: boost/unordered_map.hpp: No such file or directory
ClientManager.h:6:35: error: boost/unordered_set.hpp: No such file or directory
In file included from ClientManagerGuild.cpp:3:
ClientManager.h:5:35: error: boost/unordered_map.hpp: No such file or directory
ClientManager.h:6:35: error: boost/unordered_set.hpp: No such file or directory
In file included from GuildManager.cpp:4:
ClientManager.h:5:35: error: boost/unordered_map.hpp: No such file or directory
ClientManager.h:6:35: error: boost/unordered_set.hpp: No such file or directory
In file included from PrivManager.cpp:3:
ClientManager.h:5:35: error: boost/unordered_map.hpp: No such file or directory
ClientManager.h:6:35: error: boost/unordered_set.hpp: No such file or directory
In file included from MoneyLog.cpp:3:
ClientManager.h:5:35: error: boost/unordered_map.hpp: No such file or directory
ClientManager.h:6:35: error: boost/unordered_set.hpp: No such file or directory
In file included from ItemAwardManager.cpp:7:
ClientManager.h:5:35: error: boost/unordered_map.hpp: No such file or directory
ClientManager.h:6:35: error: boost/unordered_set.hpp: No such file or directory
In file included from DBManager.cpp:3:
ClientManager.h:35: error: 'boost' has not been declared
ClientManager.h:35: error: ISO C++ forbids declaration of 'unordered_map' with no type
ClientManager.h:35: error: typedef name may not be a nested-name-specifier
ClientManager.h:35: error: expected ';' before '<' token
ClientManager.h:36: error: 'boost' has not been declared
ClientManager.h:36: error: ISO C++ forbids declaration of 'unordered_map' with no type
ClientManager.h:36: error: typedef name may not be a nested-name-specifier
ClientManager.h:36: error: expected ';' before '<' token
ClientManager.h:37: error: 'boost' has not been declared
ClientManager.h:37: error: ISO C++ forbids declaration of 'unordered_set' with no type
ClientManager.h:37: error: typedef name may not be a nested-name-specifier
ClientManager.h:37: error: expected ';' before '<' token
ClientManager.h:38: error: 'boost' has not been declared
ClientManager.h:38: error: ISO C++ forbids declaration of 'unordered_map' with no type
ClientManager.h:38: error: typedef name may not be a nested-name-specifier
ClientManager.h:38: error: expected ';' before '<' token
ClientManager.h:39: error: 'boost' has not been declared
ClientManager.h:39: error: ISO C++ forbids declaration of 'unordered_map' with no type
ClientManager.h:39: error: typedef name may not be a nested-name-specifier
ClientManager.h:39: error: expected ';' before '<' token
ClientManager.h:40: error: 'boost' has not been declared
ClientManager.h:40: error: ISO C++ forbids declaration of 'unordered_map' with no type
ClientManager.h:40: error: typedef name may not be a nested-name-specifier
ClientManager.h:40: error: expected ';' before '<' token
ClientManager.h:120: error: ISO C++ forbids declaration of 'TItemCacheSet' with no type
ClientManager.h:120: error: expected ';' before '*' token
ClientManager.h:395: error: 'boost' has not been declared
ClientManager.h:395: error: ISO C++ forbids declaration of 'unordered_map' with no type
ClientManager.h:395: error: typedef name may not be a nested-name-specifier
ClientManager.h:395: error: expected ';' before '<' token
ClientManager.h:396: error: 'TLoginDataByLoginKey' does not name a type
ClientManager.h:399: error: 'boost' has not been declared
ClientManager.h:399: error: ISO C++ forbids declaration of 'unordered_map' with no type
ClientManager.h:399: error: typedef name may not be a nested-name-specifier
ClientManager.h:399: error: expected ';' before '<' token
ClientManager.h:400: error: 'TLoginDataByLogin' does not name a type
ClientManager.h:403: error: 'boost' has not been declared
ClientManager.h:403: error: ISO C++ forbids declaration of 'unordered_map' with no type
ClientManager.h:403: error: typedef name may not be a nested-name-specifier
ClientManager.h:403: error: expected ';' before '<' token
ClientManager.h:404: error: 'TLoginDataByAID' does not name a type
ClientManager.h:407: error: 'boost' has not been declared
ClientManager.h:407: error: ISO C++ forbids declaration of 'unordered_map' with no type
ClientManager.h:407: error: typedef name may not be a nested-name-specifier
ClientManager.h:407: error: expected ';' before '<' token
ClientManager.h:408: error: 'TLogonAccountMap' does not name a type
ClientManager.h:438: error: 'TPlayerTableCacheMap' does not name a type
ClientManager.h:440: error: 'TItemCacheMap' does not name a type
ClientManager.h:441: error: 'TItemCacheSetPtrMap' does not name a type
ClientManager.h:445: error: 'TItemPriceListCacheMap' does not name a type
ClientManager.h:448: error: 'TChannelStatusMap' does not name a type
ClientManager.h:513: error: 'boost' has not been declared
ClientManager.h:513: error: ISO C++ forbids declaration of 'unordered_map' with no type
ClientManager.h:513: error: typedef name may not be a nested-name-specifier
ClientManager.h:513: error: expected ';' before '<' token
ClientManager.h:514: error: 'TLogoutPlayerMap' does not name a type
In file included from Cache.cpp:6:
ClientManager.h:35: error: 'boost' has not been declared
ClientManager.h:35: error: ISO C++ forbids declaration of 'unordered_map' with no type
ClientManager.h:35: error: typedef name may not be a nested-name-specifier
ClientManager.h:35: error: expected ';' before '<' token
ClientManager.h:36: error: 'boost' has not been declared
ClientManager.h:36: error: ISO C++ forbids declaration of 'unordered_map' with no type
ClientManager.h:36: error: typedef name may not be a nested-name-specifier
ClientManager.h:36: error: expected ';' before '<' token
ClientManager.h:37: error: 'boost' has not been declared
ClientManager.h:37: error: ISO C++ forbids declaration of 'unordered_set' with no type
ClientManager.h:37: error: typedef name may not be a nested-name-specifier
ClientManager.h:37: error: expected ';' before '<' token
ClientManager.h:38: error: 'boost' has not been declared
ClientManager.h:38: error: ISO C++ forbids declaration of 'unordered_map' with no type
ClientManager.h:38: error: typedef name may not be a nested-name-specifier
ClientManager.h:38: error: expected ';' before '<' token
ClientManager.h:39: error: 'boost' has not been declared



