Salut, am incercat sa compilez sursa nirvana binary v1 2016 cu vs 2008 express edition + sp1 si primesc urmatoarele erori
1>------ Build started: Project: scriptLib, Configuration: Distribute Win32 ------
2>------ Build started: Project: EterLocale, Configuration: Distribute Win32 ------
3>------ Build started: Project: mileslib, Configuration: Distribute Win32 ------
4>------ Build started: Project: gamelib, Configuration: Distribute Win32 ------
2>Compiling...
5>------ Build started: Project: eterPythonLib, Configuration: Distribute Win32 ------
6>------ Build started: Project: eterImageLib, Configuration: Distribute Win32 ------
3>Compiling...
7>------ Build started: Project: eterGrnLib, Configuration: Distribute Win32 ------
1>Compiling...
8>------ Build started: Project: eterBase, Configuration: Distribute Win32 ------
5>Compiling...
6>Compiling...
4>Compiling...
8>Compiling...
7>Compiling...
2>StdAfx.cpp
5>StdAfx.cpp
3>Stdafx.cpp
1>StdAfx.cpp
6>StdAfx.cpp
4>StdAfx.cpp
8>Base.cpp
7>StdAfx.cpp
2>d:\sursa originala\new folder\sursa_client\sursa\nicu\srcs\client\eterlocale\stdafx.h(10) : fatal error C1083: Cannot open include file: 'windows.h': No such file or directory
8>d:\sursa originala\new folder\sursa_client\sursa\nicu\srcs\client\eterbase\poly\../StdAfx.h(12) : fatal error C1083: Cannot open include file: 'windows.h': No such file or directory
6>d:\sursa originala\new folder\sursa_client\sursa\nicu\srcs\client\eterimagelib\stdafx.h(19) : fatal error C1083: Cannot open include file: 'windows.h': No such file or directory
3>d:\SURSA ORIGINALA\New folder\SURSA_CLIENT\SURSA\nICU\Srcs\extern\include\mss.h(261) : fatal error C1083: Cannot open include file: 'windows.h': No such file or directory
4>d:\sursa originala\new folder\sursa_client\sursa\nicu\srcs\client\gamelib\../eterBase/Utils.h(4) : fatal error C1083: Cannot open include file: 'windows.h': No such file or directory
1>d:\SURSA ORIGINALA\New folder\SURSA_CLIENT\SURSA\nICU\Srcs\extern\include\d3d8.h(30) : fatal error C1083: Cannot open include file: 'stdlib.h': No such file or directory
5>d:\SURSA ORIGINALA\New folder\SURSA_CLIENT\SURSA\nICU\Srcs\extern\include\d3d8.h(30) : fatal error C1083: Cannot open include file: 'stdlib.h': No such file or directory
2>Build log was saved at "file://d:\SURSA ORIGINALA\New folder\SURSA_CLIENT\SURSA\nICU\Srcs\Client\EterLocale\Distribute\BuildLog.htm"
8>Utils.cpp
1>StdAfx.cpp
7>d:\sursa originala\new folder\sursa_client\sursa\nicu\srcs\client\etergrnlib\../eterBase/Utils.h(4) : fatal error C1083: Cannot open include file: 'windows.h': No such file or directory
6>Build log was saved at "file://d:\SURSA ORIGINALA\New folder\SURSA_CLIENT\SURSA\nICU\Srcs\Client\EterImageLib\Distribute\BuildLog.htm"
4>Build log was saved at "file://d:\SURSA ORIGINALA\New folder\SURSA_CLIENT\SURSA\nICU\Srcs\Client\GameLib\Distribute\BuildLog.htm"
5>Build log was saved at "file://d:\SURSA ORIGINALA\New folder\SURSA_CLIENT\SURSA\nICU\Srcs\Client\EterPythonLib\Distribute\BuildLog.htm"
7>Build log was saved at "file://d:\SURSA ORIGINALA\New folder\SURSA_CLIENT\SURSA\nICU\Srcs\Client\EterGrnLib\Distribute\BuildLog.htm"
3>Build log was saved at "file://d:\SURSA ORIGINALA\New folder\SURSA_CLIENT\SURSA\nICU\Srcs\Client\MilesLib\Distribute\BuildLog.htm"
3>mileslib - 1 error(s), 0 warning(s)
6>eterImageLib - 1 error(s), 0 warning(s)
7>eterGrnLib - 1 error(s), 0 warning(s)
5>eterPythonLib - 1 error(s), 0 warning(s)
4>gamelib - 1 error(s), 0 warning(s)
8>d:\sursa originala\new folder\sursa_client\sursa\nicu\srcs\client\eterbase\StdAfx.h(12) : fatal error C1083: Cannot open include file: 'windows.h': No such file or directory
1>d:\SURSA ORIGINALA\New folder\SURSA_CLIENT\SURSA\nICU\Srcs\extern\include\d3d8.h(30) : fatal error C1083: Cannot open include file: 'stdlib.h': No such file or directory
8>Timer.cpp
1>Build log was saved at "file://d:\SURSA ORIGINALA\New folder\SURSA_CLIENT\SURSA\nICU\Srcs\Client\ScriptLib\Distribute\BuildLog.htm"
1>scriptLib - 2 error(s), 0 warning(s)
8>d:\sursa originala\new folder\sursa_client\sursa\nicu\srcs\client\eterbase\StdAfx.h(12) : fatal error C1083: Cannot open include file: 'windows.h': No such file or directory
8>TempFile.cpp
9>------ Build started: Project: EffectLib, Configuration: Distribute Win32 ------
10>------ Build started: Project: SphereLib, Configuration: Distribute Win32 ------
11>------ Build started: Project: SpeedTreeLib, Configuration: Distribute Win32 ------
12>------ Build started: Project: PRTerrainLib, Configuration: Distribute Win32 ------
8>d:\sursa originala\new folder\sursa_client\sursa\nicu\srcs\client\eterbase\StdAfx.h(12) : fatal error C1083: Cannot open include file: 'windows.h': No such file or directory
13>------ Build started: Project: EterPack, Configuration: Distribute Win32 ------
8>tea.cpp
10>Compiling...
11>Compiling...
9>Compiling...
12>Compiling...
8>d:\sursa originala\new folder\sursa_client\sursa\nicu\srcs\client\eterbase\StdAfx.h(12) : fatal error C1083: Cannot open include file: 'windows.h': No such file or directory
2>EterLocale - 1 error(s), 0 warning(s)
8>Stl.cpp
13>Compiling...
12>StdAfx.cpp
10>StdAfx.cpp
9>StdAfx.cpp
11>StdAfx.cpp
11>d:\sursa originala\new folder\sursa_client\sursa\nicu\srcs\client\speedtreelib\stdafx.h(5) : fatal error C1083: Cannot open include file: 'assert.h': No such file or directory
9>d:\sursa originala\new folder\sursa_client\sursa\nicu\srcs\client\effectlib\../eterBase/StdAfx.h(12) : fatal error C1083: Cannot open include file: 'windows.h': No such file or directory
10>d:\SURSA ORIGINALA\New folder\SURSA_CLIENT\SURSA\nICU\Srcs\extern\include\d3d8.h(30) : fatal error C1083: Cannot open include file: 'stdlib.h': No such file or directory
12>d:\SURSA ORIGINALA\New folder\SURSA_CLIENT\SURSA\nICU\Srcs\extern\include\d3d8.h(30) : fatal error C1083: Cannot open include file: 'stdlib.h': No such file or directory
11>Build log was saved at "file://d:\SURSA ORIGINALA\New folder\SURSA_CLIENT\SURSA\nICU\Srcs\Client\SpeedTreeLib\Distribute\BuildLog.htm"
10>Build log was saved at "file://d:\SURSA ORIGINALA\New folder\SURSA_CLIENT\SURSA\nICU\Srcs\Client\SphereLib\Distribute\BuildLog.htm"
12>Build log was saved at "file://d:\SURSA ORIGINALA\New folder\SURSA_CLIENT\SURSA\nICU\Srcs\Client\PRTerrainLib\Distribute\BuildLog.htm"
9>Build log was saved at "file://d:\SURSA ORIGINALA\New folder\SURSA_CLIENT\SURSA\nICU\Srcs\Client\EffectLib\Distribute\BuildLog.htm"
12>PRTerrainLib - 1 error(s), 0 warning(s)
11>SpeedTreeLib - 1 error(s), 0 warning(s)
9>EffectLib - 1 error(s), 0 warning(s)
10>SphereLib - 1 error(s), 0 warning(s)
8>d:\sursa originala\new folder\sursa_client\sursa\nicu\srcs\client\eterbase\StdAfx.h(12) : fatal error C1083: Cannot open include file: 'windows.h': No such file or directory
8>StdAfx.cpp
13>EterPackPolicy_CSHybridCrypt.cpp
8>d:\sursa originala\new folder\sursa_client\sursa\nicu\srcs\client\eterbase\stdafx.h(12) : fatal error C1083: Cannot open include file: 'windows.h': No such file or directory
8>Random.cpp
13>d:\sursa originala\new folder\sursa_client\sursa\nicu\srcs\client\eterpack\Stdafx.h(6) : fatal error C1083: Cannot open include file: 'windows.h': No such file or directory
14>------ Build started: Project: CWebBrowser, Configuration: Distribute Win32 ------
13>EterPackManager.cpp
13>d:\sursa originala\new folder\sursa_client\sursa\nicu\srcs\client\eterpack\StdAfx.h(6) : fatal error C1083: Cannot open include file: 'windows.h': No such file or directory
13>EterPackCursor.cpp
14>Compiling...
15>------ Build started: Project: eterlib, Configuration: Distribute Win32 ------
13>d:\sursa originala\new folder\sursa_client\sursa\nicu\srcs\client\eterpack\StdAfx.h(6) : fatal error C1083: Cannot open include file: 'windows.h': No such file or directory
8>d:\sursa originala\new folder\sursa_client\sursa\nicu\srcs\client\eterbase\StdAfx.h(12) : fatal error C1083: Cannot open include file: 'windows.h': No such file or directory
13>Generating Code...
8>MappedFile.cpp
15>Compiling...
14>CWebBrowser.c
8>d:\sursa originala\new folder\sursa_client\sursa\nicu\srcs\client\eterbase\StdAfx.h(12) : fatal error C1083: Cannot open include file: 'windows.h': No such file or directory
13>Build log was saved at "file://d:\SURSA ORIGINALA\New folder\SURSA_CLIENT\SURSA\nICU\Srcs\Client\EterPack\Distribute\BuildLog.htm"
8>lzo.cpp
14>.\CWebBrowser.c(20) : fatal error C1083: Cannot open include file: 'windows.h': No such file or directory
14>Build log was saved at "file://d:\SURSA ORIGINALA\New folder\SURSA_CLIENT\SURSA\nICU\Srcs\Client\CWebBrowser\Distribute\BuildLog.htm"
15>StdAfx.cpp
14>CWebBrowser - 1 error(s), 0 warning(s)
13>EterPack - 3 error(s), 0 warning(s)
8>d:\sursa originala\new folder\sursa_client\sursa\nicu\srcs\client\eterbase\StdAfx.h(12) : fatal error C1083: Cannot open include file: 'windows.h': No such file or directory
8>FileLoader.cpp
15>d:\SURSA ORIGINALA\New folder\SURSA_CLIENT\SURSA\nICU\Srcs\extern\include\d3d8.h(30) : fatal error C1083: Cannot open include file: 'stdlib.h': No such file or directory
15>Build log was saved at "file://d:\SURSA ORIGINALA\New folder\SURSA_CLIENT\SURSA\nICU\Srcs\Client\EterLib\Distribute\BuildLog.htm"
15>eterlib - 1 error(s), 0 warning(s)
8>d:\sursa originala\new folder\sursa_client\sursa\nicu\srcs\client\eterbase\StdAfx.h(12) : fatal error C1083: Cannot open include file: 'windows.h': No such file or directory
8>FileDir.cpp
8>d:\sursa originala\new folder\sursa_client\sursa\nicu\srcs\client\eterbase\StdAfx.h(12) : fatal error C1083: Cannot open include file: 'windows.h': No such file or directory
8>FileBase.cpp
8>d:\sursa originala\new folder\sursa_client\sursa\nicu\srcs\client\eterbase\StdAfx.h(12) : fatal error C1083: Cannot open include file: 'windows.h': No such file or directory
8>error.cpp
8>d:\sursa originala\new folder\sursa_client\sursa\nicu\srcs\client\eterbase\StdAfx.h(12) : fatal error C1083: Cannot open include file: 'windows.h': No such file or directory
8>Debug.cpp
8>d:\sursa originala\new folder\sursa_client\sursa\nicu\srcs\client\eterbase\StdAfx.h(12) : fatal error C1083: Cannot open include file: 'windows.h': No such file or directory
8>CRC32.cpp
8>d:\sursa originala\new folder\sursa_client\sursa\nicu\srcs\client\eterbase\StdAfx.h(12) : fatal error C1083: Cannot open include file: 'windows.h': No such file or directory
8>CPostIt.cpp
8>d:\sursa originala\new folder\sursa_client\sursa\nicu\srcs\client\eterbase\StdAfx.h(12) : fatal error C1083: Cannot open include file: 'windows.h': No such file or directory
8>cipher.cpp
8>d:\sursa originala\new folder\sursa_client\sursa\nicu\srcs\client\eterbase\stdafx.h(12) : fatal error C1083: Cannot open include file: 'windows.h': No such file or directory
8>SymTable.cpp
8>d:\sursa originala\new folder\sursa_client\sursa\nicu\srcs\client\eterbase\poly\../StdAfx.h(12) : fatal error C1083: Cannot open include file: 'windows.h': No such file or directory
8>Symbol.cpp
8>d:\sursa originala\new folder\sursa_client\sursa\nicu\srcs\client\eterbase\poly\../StdAfx.h(12) : fatal error C1083: Cannot open include file: 'windows.h': No such file or directory
8>Generating Code...
8>Compiling...
8>Poly.cpp
8>d:\sursa originala\new folder\sursa_client\sursa\nicu\srcs\client\eterbase\poly\../StdAfx.h(12) : fatal error C1083: Cannot open include file: 'windows.h': No such file or directory
8>Generating Code...
8>Build log was saved at "file://d:\SURSA ORIGINALA\New folder\SURSA_CLIENT\SURSA\nICU\Srcs\Client\EterBase\Distribute\BuildLog.htm"
8>eterBase - 21 error(s), 0 warning(s)
16>------ Build started: Project: UserInterface, Configuration: Distribute Win32 ------
16>Compiling...
16>StdAfx.cpp
16>d:\SURSA ORIGINALA\New folder\SURSA_CLIENT\SURSA\nICU\Srcs\extern\include\d3d8.h(30) : fatal error C1083: Cannot open include file: 'stdlib.h': No such file or directory
16>Build log was saved at "file://d:\SURSA ORIGINALA\New folder\SURSA_CLIENT\SURSA\nICU\Srcs\Client\UserInterface\Distribute\BuildLog.htm"
16>UserInterface - 1 error(s), 0 warning(s)
========== Build: 0 succeeded, 16 failed, 0 up-to-date, 0 skipped ==========
Eroare compilare sursa binary nirvana v1
-
- Informaţie
-
Cine este conectat
Utilizatori ce ce navighează pe acest forum: Niciun utilizator înregistrat și 55 vizitatori

