Problema Scoatere limita yang

Totalitatea subiectelor care nu respectă regulamentul impus in sectiunea "Probleme şi Întrebări" vor fi stocate aici.
Avatar utilizator
Marius Dragomir
Membru Club

Membru Club
Mesaje: 1020
Membru din: 13 Noi 2017, 21:32
Server: HellHound
Regat: Jinno
Aprecieri: 499  
Mulţumiri: 1211  
Discord: Copiază ID
Medalii

*Problemă: Compilare sursa
Tipologie server: -
*Resursă folosită:http://just4metin.ro/sursa/limita-yang- ... 48341.html
*ServerFiles utilizat: Metin2Neleus/Sky
*Syserr:
cd /root/metin2/Server/db/src
root@metin2:~/metin2/Server/db/src # gmake clean
root@metin2:~/metin2/Server/db/src # gmake -j20
compile Config.cpp
compile NetBase.cpp
compile Peer.cpp
compile PeerBase.cpp
compile Main.cpp
compile Lock.cpp
compile DBManager.cpp
compile Cache.cpp
compile LoginData.cpp
compile ClientManager.cpp
compile ClientManagerPlayer.cpp
compile ClientManagerLogin.cpp
compile ClientManagerBoot.cpp
compile ClientManagerParty.cpp
compile ClientManagerGuild.cpp
compile GuildManager.cpp
compile HB.cpp
compile PrivManager.cpp
compile MoneyLog.cpp
compile ItemAwardManager.cpp
In file included from stdafx.h:14,
                 from PeerBase.cpp:1:
../../common/tables.h:1172: error: expected ';' before '}' token
../../common/tables.h:1172: error: expected `;' before '}' token
In file included from stdafx.h:14,
                 from Config.cpp:1:
../../common/tables.h:1172: error: expected ';' before '}' token
../../common/tables.h:1172: error: expected `;' before '}' token
In file included from stdafx.h:14,
                 from Lock.cpp:1:
../../common/tables.h:1172: error: expected ';' before '}' token
../../common/tables.h:1172: error: expected `;' before '}' token
In file included from stdafx.h:14,
                 from Peer.cpp:1:
../../common/tables.h:1172: error: expected ';' before '}' token
../../common/tables.h:1172: error: expected `;' before '}' token
In file included from stdafx.h:14,
                 from HB.cpp:1:
../../common/tables.h:1172: error: expected ';' before '}' token
../../common/tables.h:1172: error: expected `;' before '}' token
gmake: *** [.obj/PeerBase.o] Error 1
gmake: *** Waiting for unfinished jobs....
gmake: *** [.obj/HB.o] Error 1
gmake: *** [.obj/Lock.o] Error 1
gmake: *** [.obj/Peer.o] Error 1
gmake: *** [.obj/Config.o] Error 1
Cache.cpp:380:7: warning: no newline at end of file
In file included from stdafx.h:14,
                 from ClientManagerParty.cpp:2:
../../common/tables.h:1172: error: expected ';' before '}' token
../../common/tables.h:1172: error: expected `;' before '}' token
ItemAwardManager.cpp:129:2: warning: no newline at end of file
In file included from stdafx.h:14,
                 from Main.cpp:1:
../../common/tables.h:1172: error: expected ';' before '}' token
../../common/tables.h:1172: error: expected `;' before '}' token
In file included from stdafx.h:14,
                 from DBManager.cpp:1:
../../common/tables.h:1172: error: expected ';' before '}' token
../../common/tables.h:1172: error: expected `;' before '}' token
In file included from stdafx.h:14,
                 from Cache.cpp:2:
../../common/tables.h:1172: error: expected ';' before '}' token
../../common/tables.h:1172: error: expected `;' before '}' token
In file included from ClientManagerBoot.cpp:8:
ProtoReader.h:36:7: warning: no newline at end of file
In file included from stdafx.h:14,
                 from ClientManagerLogin.cpp:2:
../../common/tables.h:1172: error: expected ';' before '}' token
../../common/tables.h:1172: error: expected `;' before '}' token
In file included from stdafx.h:14,
                 from ClientManagerGuild.cpp:2:
../../common/tables.h:1172: error: expected ';' before '}' token
../../common/tables.h:1172: error: expected `;' before '}' token
In file included from stdafx.h:14,
                 from ClientManagerPlayer.cpp:2:
../../common/tables.h:1172: error: expected ';' before '}' token
../../common/tables.h:1172: error: expected `;' before '}' token
In file included from stdafx.h:14,
                 from MoneyLog.cpp:1:
../../common/tables.h:1172: error: expected ';' before '}' token
../../common/tables.h:1172: error: expected `;' before '}' token
In file included from stdafx.h:14,
                 from ItemAwardManager.cpp:1:
../../common/tables.h:1172: error: expected ';' before '}' token
../../common/tables.h:1172: error: expected `;' before '}' token
In file included from stdafx.h:14,
                 from LoginData.cpp:1:
../../common/tables.h:1172: error: expected ';' before '}' token
../../common/tables.h:1172: error: expected `;' before '}' token
In file included from stdafx.h:14,
                 from PrivManager.cpp:1:
../../common/tables.h:1172: error: expected ';' before '}' token
../../common/tables.h:1172: error: expected `;' before '}' token
In file included from stdafx.h:14,
                 from ClientManagerBoot.cpp:3:
../../common/tables.h:1172: error: expected ';' before '}' token
../../common/tables.h:1172: error: expected `;' before '}' token
In file included from stdafx.h:14,
                 from GuildManager.cpp:1:
../../common/tables.h:1172: error: expected ';' before '}' token
../../common/tables.h:1172: error: expected `;' before '}' token
In file included from stdafx.h:14,
                 from ClientManager.cpp:2:
../../common/tables.h:1172: error: expected ';' before '}' token
../../common/tables.h:1172: error: expected `;' before '}' token
In file included from stdafx.h:14,
                 from NetBase.cpp:1:
../../common/tables.h:1172: error: expected ';' before '}' token
../../common/tables.h:1172: error: expected `;' before '}' token
gmake: *** [.obj/ItemAwardManager.o] Error 1
gmake: *** [.obj/ClientManagerParty.o] Error 1
ClientManagerBoot.cpp: In member function 'bool CClientManager::InitializeMobTab                                                               le()':
ClientManagerBoot.cpp:402: warning: statement has no effect
gmake: *** [.obj/LoginData.o] Error 1
gmake: *** [.obj/ClientManagerLogin.o] Error 1
ClientManagerBoot.cpp: In member function 'bool CClientManager::InitializeItemTa                                                               ble()':
ClientManagerBoot.cpp:703: warning: unused variable 'testValue'
ClientManagerBoot.cpp: In member function 'bool CClientManager::MirrorItemTableI                                                               ntoDB()':
ClientManagerBoot.cpp:1490: warning: format '%d' expects type 'int', but argumen                                                               t 25 has type 'long int'
ClientManagerBoot.cpp:1490: warning: format '%d' expects type 'int', but argumen                                                               t 27 has type 'long int'
ClientManagerBoot.cpp:1490: warning: format '%d' expects type 'int', but argumen                                                               t 29 has type 'long int'
ClientManagerBoot.cpp:1490: warning: format '%d' expects type 'int', but argumen                                                               t 31 has type 'long int'
ClientManagerBoot.cpp:1490: warning: format '%d' expects type 'int', but argumen                                                               t 33 has type 'long int'
ClientManagerBoot.cpp:1490: warning: format '%d' expects type 'int', but argumen                                                               t 34 has type 'long int'
ClientManagerBoot.cpp:1490: warning: format '%d' expects type 'int', but argumen                                                               t 35 has type 'long int'
ClientManagerBoot.cpp:1490: warning: format '%d' expects type 'int', but argumen                                                               t 36 has type 'long int'
ClientManagerBoot.cpp:1490: warning: format '%d' expects type 'int', but argumen                                                               t 37 has type 'long int'
ClientManagerBoot.cpp:1490: warning: format '%d' expects type 'int', but argumen                                                               t 38 has type 'long int'
ClientManagerBoot.cpp:1490: warning: format '%d' expects type 'int', but argumen                                                               t 39 has type 'long int'
ClientManagerBoot.cpp:1490: warning: format '%d' expects type 'int', but argumen                                                               t 25 has type 'long int'
ClientManagerBoot.cpp:1490: warning: format '%d' expects type 'int', but argumen                                                               t 27 has type 'long int'
ClientManagerBoot.cpp:1490: warning: format '%d' expects type 'int', but argumen                                                               t 29 has type 'long int'
ClientManagerBoot.cpp:1490: warning: format '%d' expects type 'int', but argumen                                                               t 31 has type 'long int'
ClientManagerBoot.cpp:1490: warning: format '%d' expects type 'int', but argumen                                                               t 33 has type 'long int'
ClientManagerBoot.cpp:1490: warning: format '%d' expects type 'int', but argumen                                                               t 34 has type 'long int'
ClientManagerBoot.cpp:1490: warning: format '%d' expects type 'int', but argumen                                                               t 35 has type 'long int'
ClientManagerBoot.cpp:1490: warning: format '%d' expects type 'int', but argumen                                                               t 36 has type 'long int'
ClientManagerBoot.cpp:1490: warning: format '%d' expects type 'int', but argumen                                                               t 37 has type 'long int'
ClientManagerBoot.cpp:1490: warning: format '%d' expects type 'int', but argumen                                                               t 38 has type 'long int'
ClientManagerBoot.cpp:1490: warning: format '%d' expects type 'int', but argumen                                                               t 39 has type 'long int'
ClientManagerBoot.cpp:1518: warning: format '%d' expects type 'int', but argumen                                                               t 23 has type 'long int'
ClientManagerBoot.cpp:1518: warning: format '%d' expects type 'int', but argumen                                                               t 25 has type 'long int'
ClientManagerBoot.cpp:1518: warning: format '%d' expects type 'int', but argumen                                                               t 27 has type 'long int'
ClientManagerBoot.cpp:1518: warning: format '%d' expects type 'int', but argumen                                                               t 29 has type 'long int'
ClientManagerBoot.cpp:1518: warning: format '%d' expects type 'int', but argumen                                                               t 31 has type 'long int'
ClientManagerBoot.cpp:1518: warning: format '%d' expects type 'int', but argumen                                                               t 32 has type 'long int'
ClientManagerBoot.cpp:1518: warning: format '%d' expects type 'int', but argumen                                                               t 33 has type 'long int'
ClientManagerBoot.cpp:1518: warning: format '%d' expects type 'int', but argumen                                                               t 34 has type 'long int'
ClientManagerBoot.cpp:1518: warning: format '%d' expects type 'int', but argumen                                                               t 35 has type 'long int'
ClientManagerBoot.cpp:1518: warning: format '%d' expects type 'int', but argumen                                                               t 36 has type 'long int'
ClientManagerBoot.cpp:1518: warning: format '%d' expects type 'int', but argumen                                                               t 37 has type 'long int'
ClientManagerBoot.cpp:1518: warning: format '%d' expects type 'int', but argumen                                                               t 23 has type 'long int'
ClientManagerBoot.cpp:1518: warning: format '%d' expects type 'int', but argumen                                                               t 25 has type 'long int'
ClientManagerBoot.cpp:1518: warning: format '%d' expects type 'int', but argumen                                                               t 27 has type 'long int'
ClientManagerBoot.cpp:1518: warning: format '%d' expects type 'int', but argumen                                                               t 29 has type 'long int'
ClientManagerBoot.cpp:1518: warning: format '%d' expects type 'int', but argumen                                                               t 31 has type 'long int'
ClientManagerBoot.cpp:1518: warning: format '%d' expects type 'int', but argumen                                                               t 32 has type 'long int'
ClientManagerBoot.cpp:1518: warning: format '%d' expects type 'int', but argumen                                                               t 33 has type 'long int'
ClientManagerBoot.cpp:1518: warning: format '%d' expects type 'int', but argumen                                                               t 34 has type 'long int'
ClientManagerBoot.cpp:1518: warning: format '%d' expects type 'int', but argumen                                                               t 35 has type 'long int'
ClientManagerBoot.cpp:1518: warning: format '%d' expects type 'int', but argumen                                                               t 36 has type 'long int'
ClientManagerBoot.cpp:1518: warning: format '%d' expects type 'int', but argumen                                                               t 37 has type 'long int'
gmake: *** [.obj/NetBase.o] Error 1
gmake: *** [.obj/ClientManagerGuild.o] Error 1
ClientManagerPlayer.cpp: In function 'size_t CreatePlayerSaveQuery(char*, size_t                                                               , TPlayerTable*)':
ClientManagerPlayer.cpp:161: warning: format '%d' expects type 'int', but argume                                                               nt 15 has type 'long int'
ClientManagerPlayer.cpp:161: warning: format '%d' expects type 'int', but argume                                                               nt 16 has type 'long int'
ClientManagerPlayer.cpp:161: warning: format '%d' expects type 'int', but argume                                                               nt 15 has type 'long int'
ClientManagerPlayer.cpp:161: warning: format '%d' expects type 'int', but argume                                                               nt 16 has type 'long int'
ClientManagerPlayer.cpp: In member function 'char* CClientManager::GetCommand(ch                                                               ar*)':
ClientManagerPlayer.cpp:365: warning: address of local variable 'command' return                                                               ed
gmake: *** [.obj/ClientManagerBoot.o] Error 1
ClientManagerPlayer.cpp: In member function 'void CClientManager::__QUERY_PLAYER                                                               _CREATE(CPeer*, DWORD, TPlayerCreatePacket*)':
ClientManagerPlayer.cpp:789: warning: format '%d' expects type 'int', but argume                                                               nt 18 has type 'long int'
ClientManagerPlayer.cpp:789: warning: format '%d' expects type 'int', but argume                                                               nt 19 has type 'long int'
ClientManagerPlayer.cpp:789: warning: format '%d' expects type 'int', but argume                                                               nt 27 has type 'long long int'
ClientManagerPlayer.cpp:789: warning: format '%d' expects type 'int', but argume                                                               nt 18 has type 'long int'
ClientManagerPlayer.cpp:789: warning: format '%d' expects type 'int', but argume                                                               nt 19 has type 'long int'
ClientManagerPlayer.cpp:789: warning: format '%d' expects type 'int', but argume                                                               nt 27 has type 'long long int'
gmake: *** [.obj/PrivManager.o] Error 1
Cache.cpp: In member function 'virtual void CItemPriceListTableCache::OnFlush()'                                                               :
Cache.cpp:280: warning: format '%u' expects type 'unsigned int', but argument 7                                                                has type 'long long int'
Cache.cpp:280: warning: format '%u' expects type 'unsigned int', but argument 7                                                                has type 'long long int'
gmake: *** [.obj/ClientManagerPlayer.o] Error 1
MoneyLog.cpp: In member function 'void CMoneyLog::Save()':
MoneyLog.cpp:28: error: 'struct TPacketMoneyLog' has no member named 'gold'
ClientManager.cpp: In member function 'void CClientManager::MoneyLog(TPacketMone                                                               yLog*)':
ClientManager.cpp:1631: error: 'struct SPacketMoneyLog' has no member named 'gol                                                               d'
gmake: *** [.obj/DBManager.o] Error 1
gmake: *** [.obj/Main.o] Error 1
gmake: *** [.obj/MoneyLog.o] Error 1
gmake: *** [.obj/Cache.o] Error 1
ClientManager.cpp: In member function 'void CClientManager::ChangeMonarchLord(CP                                                               eer*, DWORD, TPacketChangeMonarchLord*)':
ClientManager.cpp:4117: warning: too few arguments for format
ClientManager.cpp:4117: warning: too few arguments for format
gmake: *** [.obj/GuildManager.o] Error 1
gmake: *** [.obj/ClientManager.o] Error 1
root@metin2:~/metin2/Server/db/src # cd /root/metin2/Server/game/src
root@metin2:~/metin2/Server/game/src # gmake clean
root@metin2:~/metin2/Server/game/src # gmake -j20
compile BattleArena.cpp
compile FSM.cpp
compile MarkConvert.cpp
compile MarkImage.cpp
compile MarkManager.cpp
compile OXEvent.cpp
compile TrafficProfiler.cpp
compile ani.cpp
compile arena.cpp
compile banword.cpp
compile battle.cpp
compile blend_item.cpp
compile block_country.cpp
compile buffer_manager.cpp
compile building.cpp
compile castle.cpp
compile char.cpp
compile char_affect.cpp
compile char_battle.cpp
compile char_change_empire.cpp
In file included from arena.cpp:4:
packet.h:2455:7: warning: no newline at end of file
In file included from packet_info.h:4,
                 from input.h:4,
                 from desc.h:5,
                 from battle.cpp:4:
packet.h:2455:7: warning: no newline at end of file
compile char_horse.cpp
In file included from building.cpp:7:
packet.h:2455:7: warning: no newline at end of file
In file included from packet_info.h:4,
                 from input.h:4,
                 from desc.h:5,
                 from char_battle.cpp:4:
packet.h:2455:7: warning: no newline at end of file
In file included from OXEvent.cpp:6:
packet.h:2455:7: warning: no newline at end of file
In file included from constants.h:4,
                 from blend_item.cpp:11:
../../common/tables.h:1172: error: expected ';' before '}' token
../../common/tables.h:1172: error: expected `;' before '}' token
In file included from constants.h:4,
                 from block_country.cpp:11:
../../common/tables.h:1172: error: expected ';' before '}' token
../../common/tables.h:1172: error: expected `;' before '}' token
compile char_item.cpp
compile char_manager.cpp
In file included from packet_info.h:4,
                 from input.h:4,
                 from desc.h:5,
                 from desc_client.h:4,
                 from char.cpp:12:
packet.h:2455:7: warning: no newline at end of file
In file included from char_affect.cpp:8:
packet.h:2455:7: warning: no newline at end of file
In file included from char.cpp:69:
offlineshop_config.h:19:7: warning: no newline at end of file
char.cpp:7601: warning: this decimal constant is unsigned only in ISO C90
gmake: *** [OBJDIR/block_country.o] Error 1
gmake: *** Waiting for unfinished jobs....
gmake: *** [OBJDIR/blend_item.o] Error 1
In file included from constants.h:4,
                 from BattleArena.cpp:2:
../../common/tables.h:1172: error: expected ';' before '}' token
../../common/tables.h:1172: error: expected `;' before '}' token
In file included from char_horse.cpp:5:
packet.h:2455:7: warning: no newline at end of file
In file included from constants.h:4,
                 from desc.h:4,
                 from battle.cpp:4:
../../common/tables.h:1172: error: expected ';' before '}' token
../../common/tables.h:1172: error: expected `;' before '}' token
In file included from packet_info.h:4,
                 from input.h:4,
                 from desc.h:5,
                 from char_manager.cpp:4:
packet.h:2455:7: warning: no newline at end of file
In file included from packet_info.h:4,
                 from input.h:4,
                 from desc.h:5,
                 from char_item.cpp:10:
packet.h:2455:7: warning: no newline at end of file
In file included from constants.h:4,
                 from OXEvent.cpp:2:
../../common/tables.h:1172: error: expected ';' before '}' token
../../common/tables.h:1172: error: expected `;' before '}' token
In file included from constants.h:4,
                 from arena.cpp:2:
../../common/tables.h:1172: error: expected ';' before '}' token
../../common/tables.h:1172: error: expected `;' before '}' token
In file included from constants.h:4,
                 from banword.cpp:2:
../../common/tables.h:1172: error: expected ';' before '}' token
../../common/tables.h:1172: error: expected `;' before '}' token
In file included from constants.h:4,
                 from desc.h:4,
                 from char_battle.cpp:4:
../../common/tables.h:1172: error: expected ';' before '}' token
../../common/tables.h:1172: error: expected `;' before '}' token
In file included from constants.h:4,
                 from building.cpp:2:
../../common/tables.h:1172: error: expected ';' before '}' token
../../common/tables.h:1172: error: expected `;' before '}' token
In file included from constants.h:4,
                 from horse_rider.h:4,
                 from char.h:9,
                 from char_affect.cpp:5:
../../common/tables.h:1172: error: expected ';' before '}' token
../../common/tables.h:1172: error: expected `;' before '}' token
In file included from constants.h:4,
                 from horse_rider.h:4,
                 from char.h:9,
                 from ani.cpp:11:
../../common/tables.h:1172: error: expected ';' before '}' token
../../common/tables.h:1172: error: expected `;' before '}' token
In file included from constants.h:4,
                 from castle.cpp:13:
../../common/tables.h:1172: error: expected ';' before '}' token
../../common/tables.h:1172: error: expected `;' before '}' token
gmake: *** [OBJDIR/banword.o] Error 1
In file included from constants.h:4,
                 from horse_rider.h:4,
                 from char.h:9,
                 from char_change_empire.cpp:4:
../../common/tables.h:1172: error: expected ';' before '}' token
../../common/tables.h:1172: error: expected `;' before '}' token
In file included from constants.h:4,
                 from horse_rider.h:4,
                 from char.h:9,
                 from char_horse.cpp:3:
../../common/tables.h:1172: error: expected ';' before '}' token
../../common/tables.h:1172: error: expected `;' before '}' token
In file included from constants.h:4,
                 from horse_rider.h:4,
                 from char.h:9,
                 from char.cpp:6:
../../common/tables.h:1172: error: expected ';' before '}' token
../../common/tables.h:1172: error: expected `;' before '}' token
gmake: *** [OBJDIR/ani.o] Error 1
In file included from constants.h:4,
                 from char_manager.cpp:2:
../../common/tables.h:1172: error: expected ';' before '}' token
../../common/tables.h:1172: error: expected `;' before '}' token
In file included from constants.h:4,
                 from horse_rider.h:4,
                 from char.h:9,
                 from char_item.cpp:7:
../../common/tables.h:1172: error: expected ';' before '}' token
../../common/tables.h:1172: error: expected `;' before '}' token
char_change_empire.cpp: In member function 'int CHARACTER::ChangeEmpire(BYTE)':
char_change_empire.cpp:29: warning: too few arguments for format
char_change_empire.cpp:29: warning: too few arguments for format
char_change_empire.cpp:89: warning: too few arguments for format
char_change_empire.cpp:89: warning: too few arguments for format
char_change_empire.cpp: In member function 'DWORD CHARACTER::GetAID() const':
char_change_empire.cpp:163: warning: too few arguments for format
char_change_empire.cpp:163: warning: too few arguments for format
gmake: *** [OBJDIR/char_change_empire.o] Error 1
gmake: *** [OBJDIR/char_affect.o] Error 1
gmake: *** [OBJDIR/OXEvent.o] Error 1
gmake: *** [OBJDIR/BattleArena.o] Error 1
gmake: *** [OBJDIR/arena.o] Error 1
gmake: *** [OBJDIR/castle.o] Error 1
gmake: *** [OBJDIR/char_horse.o] Error 1
gmake: *** [OBJDIR/battle.o] Error 1
gmake: *** [OBJDIR/building.o] Error 1
char_item.cpp: In member function 'bool CHARACTER::IsEmptyItemGrid(TItemPos, BYTE, int) const':
char_item.cpp:640: warning: comparison is always false due to limited range of data type
char_item.cpp:666: warning: comparison is always false due to limited range of data type
char_item.cpp: In member function 'bool CHARACTER::UseItemEx(CItem*, TItemPos)':
char_item.cpp:2426: warning: format '%d' expects type 'int', but argument 6 has type 'long int'
char_item.cpp:2430: warning: format '%d' expects type 'int', but argument 6 has type 'long int'
char_item.cpp:2442: warning: format '%d' expects type 'int', but argument 5 has type 'long int'
char_item.cpp:2446: warning: format '%d' expects type 'int', but argument 5 has type 'long int'
char_item.cpp:2473: warning: format '%d' expects type 'int', but argument 6 has type 'long int'
char_item.cpp:2481: warning: format '%d' expects type 'int', but argument 5 has type 'long int'
char_item.cpp:5127: warning: comparison between signed and unsigned integer expressions
char_item.cpp:1709: warning: unused variable 'bDestInven'
char_item.cpp: In member function 'bool CHARACTER::UseItem(TItemPos, TItemPos)':
char_item.cpp:5197: warning: unused variable 'wCell'
char_item.cpp:5198: warning: unused variable 'window_type'
char_item.cpp:5199: warning: unused variable 'wDestCell'
char_item.cpp:5200: warning: unused variable 'bDestInven'
char_item.cpp: In member function 'bool CHARACTER::EquipItem(CItem*, int)':
char_item.cpp:6226: warning: array subscript has type 'char'
char_item.cpp: In member function 'bool CHARACTER::CanEquipNow(CItem*, const TItemPos&, const TItemPos&)':
char_item.cpp:7623: warning: unused variable 'itemType'
char_item.cpp:7624: warning: unused variable 'itemSubType'
gmake: *** [OBJDIR/char_manager.o] Error 1
char.cpp: In member function 'void CHARACTER::OpenMyOfflineShop(const char*, TShopItemTable*, BYTE, BYTE)':
char.cpp:4156: warning: comparison is always false due to limited range of data type
char.cpp:4307: warning: format '%u' expects type 'unsigned int', but argument 8 has type 'long long int'
char.cpp:4307: warning: format '%u' expects type 'unsigned int', but argument 8 has type 'long long int'
gmake: *** [OBJDIR/char_battle.o] Error 1
gmake: *** [OBJDIR/char_item.o] Error 1
gmake: *** [OBJDIR/char.o] Error 1
Poză:
*Detalii suplimentare: Aceasta eroare o primesc cand compilez sursa game pentru scoaterea limitei de yang, am editat exact cum e in tutorial, nu am gresit nimic ca am revizuit...
Pentru acest mesaj, Marius Dragomir for the post:
madalin.sandita
Continut: Ascuns
Trebuie sa multumesti autorului pentru a putea vedea mesajul.
Afișează semnătura
Avatar utilizator
F-l-o-r-i-n
Nivel 3

Nivel 3
Mesaje: 320
Membru din: 12 Ian 2018, 14:07
Server: Thrones2
Regat: Chunjo
Aprecieri: 44  
Mulţumiri: 713  
Medalii

pune tables.h pe pastebin
Avatar utilizator
Marius Dragomir
Membru Club

Membru Club
Mesaje: 1020
Membru din: 13 Noi 2017, 21:32
Server: HellHound
Regat: Jinno
Aprecieri: 499  
Mulţumiri: 1211  
Discord: Copiază ID
Medalii

Adrian1428 scrie:pune tables.h pe pastebin

Aici tables.h
Continut: Ascuns
Trebuie sa multumesti autorului pentru a putea vedea mesajul.
Afișează semnătura
Avatar utilizator
Titan
Metin Master

Metin Master
Mesaje: 2783
Membru din: 01 Iun 2015, 15:09
Server: In curand.
Regat: Chunjo
Aprecieri: 42  
Mulţumiri: 377  
  Rezolvări prob.: 3
Discord: Copiază ID
 Contact:
Medalii

mariusdrg95 scrie:
Adrian1428 scrie:pune tables.h pe pastebin

Aici tables.h
Cauta in tables.h :

Cod: Selectaţi tot

typedef struct SPacketMoneyLog
{
    BYTE type;
    DWORD vnum;
    long long   gold
} TPacketMoneyLog;
Inlocuieste cu:

Cod: Selectaţi tot

typedef struct SPacketMoneyLog
{
    BYTE type;
    DWORD vnum;
    long long gold;
} TPacketMoneyLog;
Pentru acest mesaj, Titan for the post:
F-l-o-r-i-n
Imagine
Afișează semnătura
Avatar utilizator
Marius Dragomir
Membru Club

Membru Club
Mesaje: 1020
Membru din: 13 Noi 2017, 21:32
Server: HellHound
Regat: Jinno
Aprecieri: 499  
Mulţumiri: 1211  
Discord: Copiază ID
Medalii

eXplode scrie:
mariusdrg95 scrie:
Adrian1428 scrie:pune tables.h pe pastebin

Aici tables.h
Cauta in tables.h :

Cod: Selectaţi tot

typedef struct SPacketMoneyLog
{
    BYTE type;
    DWORD vnum;
    long long   gold
} TPacketMoneyLog;
Inlocuieste cu:

Cod: Selectaţi tot

typedef struct SPacketMoneyLog
{
    BYTE type;
    DWORD vnum;
    long long gold;
} TPacketMoneyLog;
Am facut si acum imi apare asa
root@metin2:~ # cd /root/Sky-Src/Server/db/src
root@metin2:~/Sky-Src/Server/db/src # gmake clean
root@metin2:~/Sky-Src/Server/db/src # gmake -j20
compile Config.cpp
compile NetBase.cpp
compile Peer.cpp
compile PeerBase.cpp
compile Main.cpp
compile Lock.cpp
compile DBManager.cpp
compile Cache.cpp
compile LoginData.cpp
compile ClientManager.cpp
compile ClientManagerPlayer.cpp
compile ClientManagerLogin.cpp
compile ClientManagerBoot.cpp
compile ClientManagerParty.cpp
compile ClientManagerGuild.cpp
compile GuildManager.cpp
compile HB.cpp
compile PrivManager.cpp
compile MoneyLog.cpp
compile ItemAwardManager.cpp
In file included from ClientManagerBoot.cpp:8:
ProtoReader.h:36:7: warning: no newline at end of file
compile ClientManagerEventFlag.cpp
ItemAwardManager.cpp:129:2: warning: no newline at end of file
Cache.cpp:380:7: warning: no newline at end of file
compile Marriage.cpp
compile Monarch.cpp
compile BlockCountry.cpp
compile ItemIDRangeManager.cpp
ClientManagerPlayer.cpp: In function 'size_t CreatePlayerSaveQuery(char*, size_t, TPlayerTable*)':
ClientManagerPlayer.cpp:161: warning: format '%d' expects type 'int', but argument 15 has type 'long int'
ClientManagerPlayer.cpp:161: warning: format '%d' expects type 'int', but argument 16 has type 'long int'
ClientManagerPlayer.cpp:161: warning: format '%d' expects type 'int', but argument 15 has type 'long int'
ClientManagerPlayer.cpp:161: warning: format '%d' expects type 'int', but argument 16 has type 'long int'
ClientManagerPlayer.cpp: In member function 'char* CClientManager::GetCommand(char*)':
ClientManagerPlayer.cpp:365: warning: address of local variable 'command' returned
ClientManagerBoot.cpp: In member function 'bool CClientManager::InitializeMobTable()':
ClientManagerBoot.cpp:402: warning: statement has no effect
ClientManagerBoot.cpp: In member function 'bool CClientManager::InitializeItemTable()':
ClientManagerBoot.cpp:703: warning: unused variable 'testValue'
compile ClientManagerHorseName.cpp
ClientManagerPlayer.cpp: In member function 'void CClientManager::__QUERY_PLAYER_CREATE(CPeer*, DWORD, TPlayerCreatePacket*)':
ClientManagerPlayer.cpp:789: warning: format '%d' expects type 'int', but argument 18 has type 'long int'
ClientManagerPlayer.cpp:789: warning: format '%d' expects type 'int', but argument 19 has type 'long int'
ClientManagerPlayer.cpp:789: warning: format '%d' expects type 'int', but argument 27 has type 'long long int'
ClientManagerPlayer.cpp:789: warning: format '%d' expects type 'int', but argument 18 has type 'long int'
ClientManagerPlayer.cpp:789: warning: format '%d' expects type 'int', but argument 19 has type 'long int'
ClientManagerPlayer.cpp:789: warning: format '%d' expects type 'int', but argument 27 has type 'long long int'
ClientManagerBoot.cpp: In member function 'bool CClientManager::MirrorItemTableIntoDB()':
ClientManagerBoot.cpp:1490: warning: format '%d' expects type 'int', but argument 25 has type 'long int'
ClientManagerBoot.cpp:1490: warning: format '%d' expects type 'int', but argument 27 has type 'long int'
ClientManagerBoot.cpp:1490: warning: format '%d' expects type 'int', but argument 29 has type 'long int'
ClientManagerBoot.cpp:1490: warning: format '%d' expects type 'int', but argument 31 has type 'long int'
ClientManagerBoot.cpp:1490: warning: format '%d' expects type 'int', but argument 33 has type 'long int'
ClientManagerBoot.cpp:1490: warning: format '%d' expects type 'int', but argument 34 has type 'long int'
ClientManagerBoot.cpp:1490: warning: format '%d' expects type 'int', but argument 35 has type 'long int'
ClientManagerBoot.cpp:1490: warning: format '%d' expects type 'int', but argument 36 has type 'long int'
ClientManagerBoot.cpp:1490: warning: format '%d' expects type 'int', but argument 37 has type 'long int'
ClientManagerBoot.cpp:1490: warning: format '%d' expects type 'int', but argument 38 has type 'long int'
ClientManagerBoot.cpp:1490: warning: format '%d' expects type 'int', but argument 39 has type 'long int'
ClientManagerBoot.cpp:1490: warning: format '%d' expects type 'int', but argument 25 has type 'long int'
ClientManagerBoot.cpp:1490: warning: format '%d' expects type 'int', but argument 27 has type 'long int'
ClientManagerBoot.cpp:1490: warning: format '%d' expects type 'int', but argument 29 has type 'long int'
ClientManagerBoot.cpp:1490: warning: format '%d' expects type 'int', but argument 31 has type 'long int'
ClientManagerBoot.cpp:1490: warning: format '%d' expects type 'int', but argument 33 has type 'long int'
ClientManagerBoot.cpp:1490: warning: format '%d' expects type 'int', but argument 34 has type 'long int'
ClientManagerBoot.cpp:1490: warning: format '%d' expects type 'int', but argument 35 has type 'long int'
ClientManagerBoot.cpp:1490: warning: format '%d' expects type 'int', but argument 36 has type 'long int'
ClientManagerBoot.cpp:1490: warning: format '%d' expects type 'int', but argument 37 has type 'long int'
ClientManagerBoot.cpp:1490: warning: format '%d' expects type 'int', but argument 38 has type 'long int'
ClientManagerBoot.cpp:1490: warning: format '%d' expects type 'int', but argument 39 has type 'long int'
ClientManagerBoot.cpp:1518: warning: format '%d' expects type 'int', but argument 23 has type 'long int'
ClientManagerBoot.cpp:1518: warning: format '%d' expects type 'int', but argument 25 has type 'long int'
ClientManagerBoot.cpp:1518: warning: format '%d' expects type 'int', but argument 27 has type 'long int'
ClientManagerBoot.cpp:1518: warning: format '%d' expects type 'int', but argument 29 has type 'long int'
ClientManagerBoot.cpp:1518: warning: format '%d' expects type 'int', but argument 31 has type 'long int'
ClientManagerBoot.cpp:1518: warning: format '%d' expects type 'int', but argument 32 has type 'long int'
ClientManagerBoot.cpp:1518: warning: format '%d' expects type 'int', but argument 33 has type 'long int'
ClientManagerBoot.cpp:1518: warning: format '%d' expects type 'int', but argument 34 has type 'long int'
ClientManagerBoot.cpp:1518: warning: format '%d' expects type 'int', but argument 35 has type 'long int'
ClientManagerBoot.cpp:1518: warning: format '%d' expects type 'int', but argument 36 has type 'long int'
ClientManagerBoot.cpp:1518: warning: format '%d' expects type 'int', but argument 37 has type 'long int'
ClientManagerBoot.cpp:1518: warning: format '%d' expects type 'int', but argument 23 has type 'long int'
ClientManagerBoot.cpp:1518: warning: format '%d' expects type 'int', but argument 25 has type 'long int'
ClientManagerBoot.cpp:1518: warning: format '%d' expects type 'int', but argument 27 has type 'long int'
ClientManagerBoot.cpp:1518: warning: format '%d' expects type 'int', but argument 29 has type 'long int'
ClientManagerBoot.cpp:1518: warning: format '%d' expects type 'int', but argument 31 has type 'long int'
ClientManagerBoot.cpp:1518: warning: format '%d' expects type 'int', but argument 32 has type 'long int'
ClientManagerBoot.cpp:1518: warning: format '%d' expects type 'int', but argument 33 has type 'long int'
ClientManagerBoot.cpp:1518: warning: format '%d' expects type 'int', but argument 34 has type 'long int'
ClientManagerBoot.cpp:1518: warning: format '%d' expects type 'int', but argument 35 has type 'long int'
ClientManagerBoot.cpp:1518: warning: format '%d' expects type 'int', but argument 36 has type 'long int'
ClientManagerBoot.cpp:1518: warning: format '%d' expects type 'int', but argument 37 has type 'long int'
Cache.cpp: In member function 'virtual void CItemPriceListTableCache::OnFlush()':
Cache.cpp:280: warning: format '%u' expects type 'unsigned int', but argument 7 has type 'long long int'
Cache.cpp:280: warning: format '%u' expects type 'unsigned int', but argument 7 has type 'long long int'
compile version.cpp
compile AuctionManager.cpp
compile ProtoReader.cpp
AuctionManager.cpp:726:7: warning: no newline at end of file
compile CsvReader.cpp
In file included from ProtoReader.cpp:4:
ProtoReader.h:36:7: warning: no newline at end of file
ClientManager.cpp: In member function 'void CClientManager::ChangeMonarchLord(CPeer*, DWORD, TPacketChangeMonarchLord*)':
ClientManager.cpp:4117: warning: too few arguments for format
ClientManager.cpp:4117: warning: too few arguments for format
ProtoReader.cpp: In function 'std::string* StringSplit(std::string, std::string)':
ProtoReader.cpp:33: warning: comparison between signed and unsigned integer expressions
ProtoReader.cpp: In function 'int get_Item_Type_Value(std::string)':
ProtoReader.cpp:87: warning: comparison between signed and unsigned integer expressions
ProtoReader.cpp: In function 'int get_Item_SubType_Value(int, std::string)':
ProtoReader.cpp:121: warning: comparison between signed and unsigned integer expressions
ProtoReader.cpp:122: warning: comparison between signed and unsigned integer expressions
ProtoReader.cpp: In function 'int get_Item_AntiFlag_Value(std::string)':
ProtoReader.cpp:154: warning: comparison between signed and unsigned integer expressions
ProtoReader.cpp: In function 'int get_Item_Flag_Value(std::string)':
ProtoReader.cpp:184: warning: comparison between signed and unsigned integer expressions
ProtoReader.cpp: In function 'int get_Item_Immune_Value(std::string)':
ProtoReader.cpp:238: warning: comparison between signed and unsigned integer expressions
ProtoReader.cpp: In function 'int get_Item_LimitType_Value(std::string)':
ProtoReader.cpp:266: warning: comparison between signed and unsigned integer expressions
ProtoReader.cpp: In function 'int get_Item_ApplyType_Value(std::string)':
ProtoReader.cpp:287: warning: comparison between signed and unsigned integer expressions
ProtoReader.cpp: In function 'int get_Mob_Rank_Value(std::string)':
ProtoReader.cpp:310: warning: comparison between signed and unsigned integer expressions
ProtoReader.cpp: In function 'int get_Mob_Type_Value(std::string)':
ProtoReader.cpp:332: warning: comparison between signed and unsigned integer expressions
ProtoReader.cpp: In function 'int get_Mob_BattleType_Value(std::string)':
ProtoReader.cpp:353: warning: comparison between signed and unsigned integer expressions
ProtoReader.cpp: In function 'int get_Mob_Size_Value(std::string)':
ProtoReader.cpp:374: warning: comparison between signed and unsigned integer expressions
ProtoReader.cpp: In function 'int get_Mob_AIFlag_Value(std::string)':
ProtoReader.cpp:396: warning: comparison between signed and unsigned integer expressions
ProtoReader.cpp: In function 'int get_Mob_RaceFlag_Value(std::string)':
ProtoReader.cpp:422: warning: comparison between signed and unsigned integer expressions
ProtoReader.cpp: In function 'int get_Mob_ImmuneFlag_Value(std::string)':
ProtoReader.cpp:447: warning: comparison between signed and unsigned integer expressions
ProtoReader.cpp: In function 'bool Set_Proto_Item_Table(TItemTable*, cCsvTable&, std::map<int, const char*, std::less<int>, std::allocator<std::pair<const int, const char*> > >&)':
ProtoReader.cpp:581: warning: comparison between signed and unsigned integer expressions
ProtoReader.cpp:642: warning: comparison between signed and unsigned integer expressions
CsvReader.cpp: In member function 'const char* cCsvAlias::operator[](size_t) const':
CsvReader.cpp:72: warning: left-hand operand of comma has no effect
CsvReader.cpp:72: warning: right-hand operand of comma has no effect
CsvReader.cpp: In member function 'size_t cCsvAlias::operator[](const char*) const':
CsvReader.cpp:90: warning: left-hand operand of comma has no effect
CsvReader.cpp:90: warning: right-hand operand of comma has no effect
linking ...
root@metin2:~/Sky-Src/Server/db/src # cd /root/Sky-Src/Server/game/src
root@metin2:~/Sky-Src/Server/game/src # gmake clean
root@metin2:~/Sky-Src/Server/game/src # gmake -j20
compile BattleArena.cpp
compile FSM.cpp
compile MarkConvert.cpp
compile MarkImage.cpp
compile MarkManager.cpp
compile OXEvent.cpp
compile TrafficProfiler.cpp
compile ani.cpp
compile arena.cpp
compile banword.cpp
compile battle.cpp
compile blend_item.cpp
compile block_country.cpp
compile buffer_manager.cpp
compile building.cpp
compile castle.cpp
compile char.cpp
In file included from arena.cpp:4:
packet.h:2455:7: warning: no newline at end of file
compile char_affect.cpp
compile char_battle.cpp
In file included from packet_info.h:4,
                 from input.h:4,
                 from desc.h:5,
                 from battle.cpp:4:
packet.h:2455:7: warning: no newline at end of file
In file included from building.cpp:7:
packet.h:2455:7: warning: no newline at end of file
In file included from packet_info.h:4,
                 from input.h:4,
                 from desc.h:5,
                 from char_battle.cpp:4:
packet.h:2455:7: warning: no newline at end of file
compile char_change_empire.cpp
compile char_horse.cpp
compile char_item.cpp
compile char_manager.cpp
In file included from OXEvent.cpp:6:
packet.h:2455:7: warning: no newline at end of file
compile char_quickslot.cpp
In file included from char_horse.cpp:5:
packet.h:2455:7: warning: no newline at end of file
In file included from packet_info.h:4,
                 from input.h:4,
                 from desc.h:5,
                 from char_item.cpp:10:
packet.h:2455:7: warning: no newline at end of file
In file included from packet_info.h:4,
                 from input.h:4,
                 from desc.h:5,
                 from desc_client.h:4,
                 from char.cpp:12:
packet.h:2455:7: warning: no newline at end of file
In file included from packet_info.h:4,
                 from input.h:4,
                 from desc.h:5,
                 from char_manager.cpp:4:
packet.h:2455:7: warning: no newline at end of file
In file included from char_affect.cpp:8:
packet.h:2455:7: warning: no newline at end of file
compile char_resist.cpp
In file included from char.cpp:69:
offlineshop_config.h:19:7: warning: no newline at end of file
char.cpp:7601: warning: this decimal constant is unsigned only in ISO C90
compile char_skill.cpp
In file included from packet_info.h:4,
                 from input.h:4,
                 from desc.h:5,
                 from char_quickslot.cpp:4:
packet.h:2455:7: warning: no newline at end of file
compile char_state.cpp
char_change_empire.cpp: In member function 'int CHARACTER::ChangeEmpire(BYTE)':
char_change_empire.cpp:29: warning: too few arguments for format
char_change_empire.cpp:29: warning: too few arguments for format
char_change_empire.cpp:89: warning: too few arguments for format
char_change_empire.cpp:89: warning: too few arguments for format
char_change_empire.cpp: In member function 'DWORD CHARACTER::GetAID() const':
char_change_empire.cpp:163: warning: too few arguments for format
char_change_empire.cpp:163: warning: too few arguments for format
In file included from packet_info.h:4,
                 from input.h:4,
                 from desc.h:5,
                 from char_skill.cpp:10:
packet.h:2455:7: warning: no newline at end of file
In file included from char_state.cpp:8:
packet.h:2455:7: warning: no newline at end of file
compile PetSystem.cpp
compile cmd.cpp
compile cmd_emotion.cpp
In file included from PetSystem.cpp:10:
packet.h:2455:7: warning: no newline at end of file
compile cmd_general.cpp
In file included from packet_info.h:4,
                 from input.h:4,
                 from desc.h:5,
                 from cmd.cpp:7:
packet.h:2455:7: warning: no newline at end of file
compile cmd_gm.cpp
In file included from packet_info.h:4,
                 from input.h:4,
                 from desc.h:5,
                 from desc_client.h:4,
                 from cmd_general.cpp:10:
packet.h:2455:7: warning: no newline at end of file
In file included from cmd_emotion.cpp:6:
packet.h:2455:7: warning: no newline at end of file
compile cmd_oxevent.cpp
compile config.cpp
char_item.cpp: In member function 'bool CHARACTER::IsEmptyItemGrid(TItemPos, BYTE, int) const':
char_item.cpp:640: warning: comparison is always false due to limited range of data type
char_item.cpp:666: warning: comparison is always false due to limited range of data type
char_item.cpp: In member function 'bool CHARACTER::UseItemEx(CItem*, TItemPos)':
char_item.cpp:2426: warning: format '%d' expects type 'int', but argument 6 has type 'long int'
char_item.cpp:2430: warning: format '%d' expects type 'int', but argument 6 has type 'long int'
char_item.cpp:2442: warning: format '%d' expects type 'int', but argument 5 has type 'long int'
char_item.cpp:2446: warning: format '%d' expects type 'int', but argument 5 has type 'long int'
char_item.cpp:2473: warning: format '%d' expects type 'int', but argument 6 has type 'long int'
char_item.cpp:2481: warning: format '%d' expects type 'int', but argument 5 has type 'long int'
In file included from packet_info.h:4,
                 from input.h:4,
                 from desc.h:5,
                 from desc_client.h:4,
                 from cmd_gm.cpp:4:
packet.h:2455:7: warning: no newline at end of file
compile constants.cpp
compile crc32.cpp
In file included from packet_info.h:4,
                 from input.h:4,
                 from desc.h:5,
                 from config.cpp:10:
packet.h:2455:7: warning: no newline at end of file
char_item.cpp:5127: warning: comparison between signed and unsigned integer expressions
char_item.cpp:1709: warning: unused variable 'bDestInven'
char_item.cpp: In member function 'bool CHARACTER::UseItem(TItemPos, TItemPos)':
char_item.cpp:5197: warning: unused variable 'wCell'
char_item.cpp:5198: warning: unused variable 'window_type'
char_item.cpp:5199: warning: unused variable 'wDestCell'
char_item.cpp:5200: warning: unused variable 'bDestInven'
char_item.cpp: In member function 'bool CHARACTER::EquipItem(CItem*, int)':
char_item.cpp:6226: warning: array subscript has type 'char'
char_item.cpp: In member function 'bool CHARACTER::CanEquipNow(CItem*, const TItemPos&, const TItemPos&)':
char_item.cpp:7623: warning: unused variable 'itemType'
char_item.cpp:7624: warning: unused variable 'itemSubType'
cmd_gm.cpp:2109:9: warning: multi-character character constant
compile cube.cpp
char_item.cpp: In member function 'bool CHARACTER::IsEmptyItemGrid(TItemPos, BYTE, int) const':
char_item.cpp:679: warning: control reaches end of non-void function
compile acce.cpp
constants.cpp:301: warning: this decimal constant is unsigned only in ISO C90
constants.cpp:302: warning: this decimal constant is unsigned only in ISO C90
constants.cpp:303: warning: this decimal constant is unsigned only in ISO C90
constants.cpp:304: warning: this decimal constant is unsigned only in ISO C90
constants.cpp:305: warning: this decimal constant is unsigned only in ISO C90
constants.cpp:306: warning: this decimal constant is unsigned only in ISO C90
constants.cpp:307: warning: this decimal constant is unsigned only in ISO C90
constants.cpp:308: warning: this decimal constant is unsigned only in ISO C90
constants.cpp:309: warning: this decimal constant is unsigned only in ISO C90
constants.cpp:310: warning: this decimal constant is unsigned only in ISO C90
constants.cpp:311: warning: this decimal constant is unsigned only in ISO C90
constants.cpp:312: warning: this decimal constant is unsigned only in ISO C90
constants.cpp:313: warning: this decimal constant is unsigned only in ISO C90
constants.cpp:314: warning: this decimal constant is unsigned only in ISO C90
constants.cpp:315: warning: this decimal constant is unsigned only in ISO C90
constants.cpp:316: warning: this decimal constant is unsigned only in ISO C90
constants.cpp:317: warning: this decimal constant is unsigned only in ISO C90
constants.cpp:318: warning: this decimal constant is unsigned only in ISO C90
constants.cpp:319: warning: this decimal constant is unsigned only in ISO C90
constants.cpp:320: warning: this decimal constant is unsigned only in ISO C90
constants.cpp:321: warning: this decimal constant is unsigned only in ISO C90
constants.cpp:322: warning: this decimal constant is unsigned only in ISO C90
constants.cpp:323: warning: this decimal constant is unsigned only in ISO C90
constants.cpp:324: warning: this decimal constant is unsigned only in ISO C90
constants.cpp:325: warning: this decimal constant is unsigned only in ISO C90
constants.cpp:326: warning: this decimal constant is unsigned only in ISO C90
constants.cpp:327: warning: this decimal constant is unsigned only in ISO C90
constants.cpp:328: warning: this decimal constant is unsigned only in ISO C90
constants.cpp:329: warning: this decimal constant is unsigned only in ISO C90
constants.cpp:330: warning: this decimal constant is unsigned only in ISO C90
constants.cpp:331: warning: this decimal constant is unsigned only in ISO C90
constants.cpp:332: warning: this decimal constant is unsigned only in ISO C90
constants.cpp:333: warning: this decimal constant is unsigned only in ISO C90
constants.cpp:334: warning: this decimal constant is unsigned only in ISO C90
constants.cpp:335: warning: this decimal constant is unsigned only in ISO C90
constants.cpp:336: warning: this decimal constant is unsigned only in ISO C90
constants.cpp:337: warning: this decimal constant is unsigned only in ISO C90
constants.cpp:338: warning: this decimal constant is unsigned only in ISO C90
constants.cpp:339: warning: this decimal constant is unsigned only in ISO C90
constants.cpp:340: warning: this decimal constant is unsigned only in ISO C90
constants.cpp:341: warning: this decimal constant is unsigned only in ISO C90
constants.cpp:342: warning: this decimal constant is unsigned only in ISO C90
constants.cpp:343: warning: this decimal constant is unsigned only in ISO C90
constants.cpp:344: warning: this decimal constant is unsigned only in ISO C90
constants.cpp:345: warning: this decimal constant is unsigned only in ISO C90
constants.cpp:346: warning: this decimal constant is unsigned only in ISO C90
constants.cpp:347: warning: this decimal constant is unsigned only in ISO C90
constants.cpp:348: warning: this decimal constant is unsigned only in ISO C90
constants.cpp:349: warning: this decimal constant is unsigned only in ISO C90
constants.cpp:350: warning: this decimal constant is unsigned only in ISO C90
constants.cpp:351: warning: this decimal constant is unsigned only in ISO C90
constants.cpp:352: warning: this decimal constant is unsigned only in ISO C90
constants.cpp:353: warning: this decimal constant is unsigned only in ISO C90
constants.cpp:354: warning: this decimal constant is unsigned only in ISO C90
constants.cpp:355: warning: this decimal constant is unsigned only in ISO C90
constants.cpp:356: warning: this decimal constant is unsigned only in ISO C90
constants.cpp:357: warning: this decimal constant is unsigned only in ISO C90
constants.cpp:358: warning: this decimal constant is unsigned only in ISO C90
constants.cpp:359: warning: this decimal constant is unsigned only in ISO C90
constants.cpp:360: warning: this decimal constant is unsigned only in ISO C90
constants.cpp:361: warning: this decimal constant is unsigned only in ISO C90
constants.cpp:362: warning: this decimal constant is unsigned only in ISO C90
constants.cpp:363: warning: this decimal constant is unsigned only in ISO C90
constants.cpp:364: warning: this decimal constant is unsigned only in ISO C90
constants.cpp:365: warning: this decimal constant is unsigned only in ISO C90
constants.cpp:366: warning: this decimal constant is unsigned only in ISO C90
constants.cpp:367: warning: this decimal constant is unsigned only in ISO C90
constants.cpp:368: warning: this decimal constant is unsigned only in ISO C90
constants.cpp:369: warning: this decimal constant is unsigned only in ISO C90
constants.cpp:370: warning: this decimal constant is unsigned only in ISO C90
constants.cpp:371: warning: this decimal constant is unsigned only in ISO C90
constants.cpp:372: warning: this decimal constant is unsigned only in ISO C90
constants.cpp:373: warning: this decimal constant is unsigned only in ISO C90
constants.cpp:374: warning: this decimal constant is unsigned only in ISO C90
constants.cpp:375: warning: this decimal constant is unsigned only in ISO C90
constants.cpp:376: warning: this decimal constant is unsigned only in ISO C90
constants.cpp:377: warning: this decimal constant is unsigned only in ISO C90
constants.cpp:378: warning: this decimal constant is unsigned only in ISO C90
constants.cpp:379: warning: this decimal constant is unsigned only in ISO C90
constants.cpp:380: warning: this decimal constant is unsigned only in ISO C90
constants.cpp:381: warning: this decimal constant is unsigned only in ISO C90
constants.cpp:382: warning: this decimal constant is unsigned only in ISO C90
constants.cpp:383: warning: this decimal constant is unsigned only in ISO C90
constants.cpp:384: warning: this decimal constant is unsigned only in ISO C90
constants.cpp:385: warning: this decimal constant is unsigned only in ISO C90
constants.cpp:386: warning: this decimal constant is unsigned only in ISO C90
constants.cpp:387: warning: this decimal constant is unsigned only in ISO C90
constants.cpp:388: warning: this decimal constant is unsigned only in ISO C90
constants.cpp:389: warning: this decimal constant is unsigned only in ISO C90
constants.cpp:390: warning: this decimal constant is unsigned only in ISO C90
constants.cpp:391: warning: this decimal constant is unsigned only in ISO C90
constants.cpp:392: warning: this decimal constant is unsigned only in ISO C90
constants.cpp:393: warning: this decimal constant is unsigned only in ISO C90
constants.cpp:394: warning: this decimal constant is unsigned only in ISO C90
constants.cpp:395: warning: this decimal constant is unsigned only in ISO C90
constants.cpp:396: warning: this decimal constant is unsigned only in ISO C90
constants.cpp:397: warning: this decimal constant is unsigned only in ISO C90
constants.cpp:398: warning: this decimal constant is unsigned only in ISO C90
constants.cpp:399: warning: this decimal constant is unsigned only in ISO C90
constants.cpp:400: warning: this decimal constant is unsigned only in ISO C90
constants.cpp:401: warning: this decimal constant is unsigned only in ISO C90
constants.cpp:402: warning: this decimal constant is unsigned only in ISO C90
constants.cpp:403: warning: this decimal constant is unsigned only in ISO C90
constants.cpp:404: warning: this decimal constant is unsigned only in ISO C90
constants.cpp:405: warning: this decimal constant is unsigned only in ISO C90
constants.cpp:406: warning: this decimal constant is unsigned only in ISO C90
constants.cpp:407: warning: this decimal constant is unsigned only in ISO C90
constants.cpp:408: warning: this decimal constant is unsigned only in ISO C90
constants.cpp:409: warning: this decimal constant is unsigned only in ISO C90
constants.cpp:410: warning: this decimal constant is unsigned only in ISO C90
constants.cpp:411: warning: this decimal constant is unsigned only in ISO C90
constants.cpp:412: warning: this decimal constant is unsigned only in ISO C90
constants.cpp:413: warning: this decimal constant is unsigned only in ISO C90
constants.cpp:414: warning: this decimal constant is unsigned only in ISO C90
constants.cpp:415: warning: this decimal constant is unsigned only in ISO C90
constants.cpp:416: warning: this decimal constant is unsigned only in ISO C90
constants.cpp:417: warning: this decimal constant is unsigned only in ISO C90
constants.cpp:418: warning: this decimal constant is unsigned only in ISO C90
constants.cpp:419: warning: this decimal constant is unsigned only in ISO C90
constants.cpp:420: warning: this decimal constant is unsigned only in ISO C90
constants.cpp:421: warning: this decimal constant is unsigned only in ISO C90
constants.cpp:422: warning: this decimal constant is unsigned only in ISO C90
constants.cpp:423: warning: this decimal constant is unsigned only in ISO C90
constants.cpp:424: warning: this decimal constant is unsigned only in ISO C90
constants.cpp:425: warning: this decimal constant is unsigned only in ISO C90
constants.cpp:426: warning: this decimal constant is unsigned only in ISO C90
constants.cpp:427: warning: this decimal constant is unsigned only in ISO C90
constants.cpp:428: warning: this decimal constant is unsigned only in ISO C90
constants.cpp:429: warning: this decimal constant is unsigned only in ISO C90
constants.cpp:430: warning: this decimal constant is unsigned only in ISO C90
constants.cpp:431: warning: this decimal constant is unsigned only in ISO C90
constants.cpp:432: warning: this decimal constant is unsigned only in ISO C90
constants.cpp:433: warning: this decimal constant is unsigned only in ISO C90
constants.cpp:434: warning: this decimal constant is unsigned only in ISO C90
constants.cpp:435: warning: this decimal constant is unsigned only in ISO C90
constants.cpp:436: warning: this decimal constant is unsigned only in ISO C90
constants.cpp:437: warning: this decimal constant is unsigned only in ISO C90
constants.cpp:438: warning: this decimal constant is unsigned only in ISO C90
constants.cpp:439: warning: this decimal constant is unsigned only in ISO C90
constants.cpp:440: warning: this decimal constant is unsigned only in ISO C90
constants.cpp:441: warning: this decimal constant is unsigned only in ISO C90
compile db.cpp
PetSystem.cpp: In member function 'virtual bool CPetActor::_UpdateFollowAI()':
PetSystem.cpp:246: warning: unused variable 'bDoMoveAlone'
PetSystem.cpp: In member function 'CPetActor* CPetSystem::Summon(DWORD, CItem*, const char*, bool, DWORD)':
PetSystem.cpp:552: warning: unused variable 'petVID'
char.cpp: In member function 'void CHARACTER::OpenMyOfflineShop(const char*, TShopItemTable*, BYTE, BYTE)':
char.cpp:4156: warning: comparison is always false due to limited range of data type
char.cpp:4307: warning: format '%u' expects type 'unsigned int', but argument 8 has type 'long long int'
char.cpp:4307: warning: format '%u' expects type 'unsigned int', but argument 8 has type 'long long int'
compile desc.cpp
In file included from packet_info.h:4,
                 from input.h:4,
                 from desc.h:5,
                 from desc_client.h:4,
                 from db.cpp:9:
packet.h:2455:7: warning: no newline at end of file
compile desc_client.cpp
compile desc_p2p.cpp
compile desc_manager.cpp
In file included from packet_info.h:4,
                 from input.h:4,
                 from desc.h:5,
                 from desc_p2p.h:1,
                 from desc_p2p.cpp:2:
packet.h:2455:7: warning: no newline at end of file
In file included from packet_info.h:4,
                 from input.h:4,
                 from desc.h:5,
                 from desc_manager.cpp:5:
packet.h:2455:7: warning: no newline at end of file
In file included from packet_info.h:4,
                 from input.h:4,
                 from desc.h:5,
                 from desc.cpp:4:
packet.h:2455:7: warning: no newline at end of file
In file included from packet_info.h:4,
                 from input.h:4,
                 from desc.h:5,
                 from desc_client.h:4,
                 from desc_client.cpp:4:
packet.h:2455:7: warning: no newline at end of file
cube.cpp: In function 'void Cube_MakeCubeInformationText()':
cube.cpp:724: warning: unused variable 'npcVNUM'
config.cpp: In function 'bool GetIPInfo()':
config.cpp:279: warning: the address of 'g_szInternalIP' will always evaluate as 'true'
config.cpp: In function 'void config_init(const std::string&)':
config.cpp:452: warning: NULL used in arithmetic
config.cpp:476: warning: NULL used in arithmetic
config.cpp:500: warning: NULL used in arithmetic
config.cpp:522: warning: unused variable 'line'
compile dev_log.cpp
acce.cpp: In function 'void FN_remove_material(CItem**, DWORD, int, int)':
acce.cpp:87: warning: unused variable 'count'
acce.cpp: In function 'bool Acce_InformationInitialize()':
acce.cpp:943: warning: comparison between signed and unsigned integer expressions
compile dungeon.cpp
compile empire_text_convert.cpp
char_item.cpp: In member function 'void CHARACTER::BuffOnAttr_ValueChange(BYTE, BYTE, BYTE)':
char_item.cpp:6354: warning: 'pBuff' may be used uninitialized in this function
compile entity.cpp
cmd_gm.cpp: In function 'void do_set_stat(CHARACTER*, const char*, int, int)':
cmd_gm.cpp:3919: warning: NULL used in arithmetic
desc_client.cpp: In member function 'void CLIENT_DESC::UpdateChannelStatus(DWORD, bool)':
desc_client.cpp:299: warning: comparison between signed and unsigned integer expressions
char_state.cpp: In member function 'virtual void CHARACTER::StateMove()':
char_state.cpp:901: warning: unused variable 'rider'
In file included from packet_info.h:4,
                 from input.h:4,
                 from desc.h:5,
                 from entity.cpp:3:
packet.h:2455:7: warning: no newline at end of file
In file included from dungeon.cpp:7:
packet.h:2455:7: warning: no newline at end of file
compile entity_view.cpp
compile event.cpp
cmd_gm.cpp:3961: warning: 'n' may be used uninitialized in this function
compile event_queue.cpp
compile exchange.cpp
In file included from packet_info.h:4,
                 from input.h:4,
                 from desc.h:5,
                 from exchange.cpp:4:
packet.h:2455:7: warning: no newline at end of file
cmd_gm.cpp: In function 'void do_use_item(CHARACTER*, const char*, int, int)':
cmd_gm.cpp:4735: warning: 'cell' may be used uninitialized in this function
compile file_loader.cpp
cmd_gm.cpp: In function 'void do_mob_ld(CHARACTER*, const char*, int, int)':
cmd_gm.cpp:855: warning: 'x' may be used uninitialized in this function
cmd_gm.cpp:855: warning: 'y' may be used uninitialized in this function
compile fishing.cpp
In file included from fishing.cpp:11:
packet.h:2455:7: warning: no newline at end of file
compile gm.cpp
compile guild.cpp
compile guild_manager.cpp
compile guild_war.cpp
compile horse_rider.cpp
compile horsename_manager.cpp
compile input.cpp
In file included from packet_info.h:4,
                 from input.h:4,
                 from desc.h:5,
                 from input.cpp:4:
packet.h:2455:7: warning: no newline at end of file
compile input_auth.cpp
In file included from packet_info.h:4,
                 from input.h:4,
                 from desc.h:5,
                 from desc_client.h:4,
                 from horsename_manager.cpp:4:
packet.h:2455:7: warning: no newline at end of file
In file included from packet_info.h:4,
                 from input.h:4,
                 from input_auth.cpp:4:
packet.h:2455:7: warning: no newline at end of file
compile input_db.cpp
In file included from guild.cpp:5:
packet.h:2455:7: warning: no newline at end of file
In file included from packet_info.h:4,
                 from input.h:4,
                 from desc.h:5,
                 from desc_client.h:4,
                 from guild_manager.cpp:9:
packet.h:2455:7: warning: no newline at end of file
In file included from guild_war.cpp:7:
packet.h:2455:7: warning: no newline at end of file
compile input_login.cpp
In file included from input_db.cpp:10:
packet.h:2455:7: warning: no newline at end of file
In file included from packet_info.h:4,
                 from input.h:4,
                 from input_login.cpp:6:
packet.h:2455:7: warning: no newline at end of file
In file included from input_db.cpp:50:
offlineshop_config.h:19:7: warning: no newline at end of file
compile input_main.cpp
In file included from packet_info.h:4,
                 from input.h:4,
                 from desc.h:5,
                 from desc_client.h:4,
                 from input_main.cpp:5:
packet.h:2455:7: warning: no newline at end of file
compile input_p2p.cpp
In file included from packet_info.h:4,
                 from input.h:4,
                 from desc.h:5,
                 from desc_client.h:4,
                 from input_p2p.cpp:4:
packet.h:2455:7: warning: no newline at end of file
compile input_teen.cpp
compile input_udp.cpp
In file included from packet_info.h:4,
                 from input.h:4,
                 from input_teen.cpp:13:
packet.h:2455:7: warning: no newline at end of file
In file included from packet_info.h:4,
                 from input.h:4,
                 from input_udp.cpp:4:
packet.h:2455:7: warning: no newline at end of file
compile ip_ban.cpp
compile item.cpp
input_auth.cpp: In member function 'int CInputAuth::auth_OpenID(const char*, const char*, char*)':
input_auth.cpp:448: warning: unused variable 'last'
compile item_addon.cpp
compile item_attribute.cpp
compile item_manager.cpp
compile item_manager_idrange.cpp
In file included from packet_info.h:4,
                 from input.h:4,
                 from desc.h:5,
                 from item_attribute.cpp:6:
packet.h:2455:7: warning: no newline at end of file
In file included from packet_info.h:4,
                 from input.h:4,
                 from desc.h:5,
                 from item.cpp:5:
packet.h:2455:7: warning: no newline at end of file
compile locale.cpp
In file included from packet_info.h:4,
                 from input.h:4,
                 from desc.h:5,
                 from desc_client.h:4,
                 from item_manager.cpp:6:
packet.h:2455:7: warning: no newline at end of file
In file included from packet_info.h:4,
                 from input.h:4,
                 from desc.h:5,
                 from desc_client.h:4,
                 from item_manager_idrange.cpp:3:
packet.h:2455:7: warning: no newline at end of file
compile locale_service.cpp
compile log.cpp
compile login_data.cpp
input_p2p.cpp: In member function 'void CInputP2P::OfflineShopBuy(DESC*, const char*)':
input_p2p.cpp:504: warning: unused variable 'p'
compile lzo_manager.cpp
compile marriage.cpp
input_main.cpp: In member function 'int CInputMain::Chat(CHARACTER*, const char*, size_t)':
input_main.cpp:756: warning: unused variable 'len_global'
input_main.cpp:762: warning: unused variable 'len_global'
input_main.cpp:766: warning: unused variable 'len_global'
input_main.cpp:770: warning: unused variable 'len_global'
input_main.cpp:774: warning: unused variable 'len_global'
input_main.cpp:782: warning: unused variable 'len_global'
input_main.cpp:786: warning: unused variable 'len_global'
input_main.cpp:790: warning: unused variable 'len_global'
input_main.cpp:794: warning: unused variable 'len_global'
input_main.cpp:800: warning: unused variable 'len_global'
In file included from packet_info.h:4,
                 from input.h:4,
                 from desc.h:5,
                 from log.cpp:7:
packet.h:2455:7: warning: no newline at end of file
compile matrix_card.cpp
item.h: In constructor 'CItem::CItem(DWORD)':
item.h:293: warning: 'CItem::m_pkRealTimeExpireEvent' will be initialized after
item.h:290: warning:   'LPEVENT CItem::m_pkExpireEvent'
item.cpp:25: warning:   when initialized here
In file included from packet_info.h:4,
                 from input.h:4,
                 from desc.h:5,
                 from desc_client.h:4,
                 from marriage.cpp:5:
packet.h:2455:7: warning: no newline at end of file
compile messenger_manager.cpp
locale_service.cpp: In function 'void __CheckPlayerSlot(const std::string&)':
locale_service.cpp:1035: warning: format '%d' expects type 'int', but argument 2 has type 'long long int'
item.cpp: In function 'const bool CanPutIntoRing(CItem*, CItem*)':
item.cpp:1746: warning: unused variable 'vnum'
item.cpp: In member function 'int CItem::GetDuration()':
item.cpp:2085: warning: array subscript has type 'char'
item.cpp:2086: warning: array subscript has type 'char'
item.cpp:2090: warning: array subscript has type 'char'
compile mining.cpp
In file included from packet_info.h:4,
                 from input.h:4,
                 from desc.h:5,
                 from desc_client.h:4,
                 from messenger_manager.cpp:6:
packet.h:2455:7: warning: no newline at end of file
compile mob_manager.cpp
compile monarch.cpp
compile motion.cpp
compile over9refine.cpp
log.cpp:11: warning: '__escape_hint' defined but not used
In file included from packet_info.h:4,
                 from input.h:4,
                 from desc.h:5,
                 from desc_client.h:4,
                 from monarch.cpp:6:
packet.h:2455:7: warning: no newline at end of file
compile p2p.cpp
compile packet_info.cpp
compile party.cpp
In file included from packet_info.h:4,
                 from input.h:4,
                 from p2p.h:7,
                 from p2p.cpp:6:
packet.h:2455:7: warning: no newline at end of file
In file included from packet_info.h:4,
                 from packet_info.cpp:4:
packet.h:2455:7: warning: no newline at end of file
compile passpod.cpp
compile pcbang.cpp
compile polymorph.cpp
In file included from packet_info.h:4,
                 from input.h:4,
                 from p2p.h:7,
                 from party.cpp:7:
packet.h:2455:7: warning: no newline at end of file
compile priv_manager.cpp
compile pvp.cpp
compile questevent.cpp
compile questlua.cpp
In file included from pvp.cpp:5:
packet.h:2455:7: warning: no newline at end of file
compile questlua_affect.cpp
compile questlua_arena.cpp
In file included from packet_info.h:4,
                 from input.h:4,
                 from desc.h:5,
                 from desc_client.h:4,
                 from priv_manager.cpp:5:
packet.h:2455:7: warning: no newline at end of file
In file included from packet_info.h:4,
                 from input.h:4,
                 from desc.h:5,
                 from questlua.cpp:9:
packet.h:2455:7: warning: no newline at end of file
compile questlua_ba.cpp
compile questlua_building.cpp
compile questlua_danceevent.cpp
compile questlua_dungeon.cpp
compile questlua_forked.cpp
compile questlua_game.cpp
In file included from questlua_dungeon.cpp:10:
packet.h:2455:7: warning: no newline at end of file
compile questlua_global.cpp
In file included from packet_info.h:4,
                 from input.h:4,
                 from p2p.h:7,
                 from questlua_forked.cpp:11:
packet.h:2455:7: warning: no newline at end of file
compile questlua_guild.cpp
In file included from packet_info.h:4,
                 from input.h:4,
                 from desc.h:5,
                 from desc_client.h:4,
                 from questlua_game.cpp:4:
packet.h:2455:7: warning: no newline at end of file
compile questlua_horse.cpp
In file included from packet_info.h:4,
                 from input.h:4,
                 from p2p.h:7,
                 from questlua_global.cpp:15:
packet.h:2455:7: warning: no newline at end of file
compile questlua_pet.cpp
compile questlua_item.cpp
In file included from packet_info.h:4,
                 from input.h:4,
                 from desc.h:5,
                 from desc_client.h:4,
                 from questlua_guild.cpp:5:
packet.h:2455:7: warning: no newline at end of file
compile questlua_marriage.cpp
questlua.cpp: In member function 'bool quest::FPartyCheckFlagLt::operator()(CHARACTER*)':
questlua.cpp:78: warning: 'returnBool' may be used uninitialized in this function
compile questlua_mgmt.cpp
compile questlua_monarch.cpp
compile questlua_npc.cpp
In file included from packet_info.h:4,
                 from input.h:4,
                 from desc.h:5,
                 from desc_client.h:4,
                 from questlua_mgmt.cpp:5:
packet.h:2455:7: warning: no newline at end of file
compile questlua_oxevent.cpp
In file included from packet_info.h:4,
                 from input.h:4,
                 from desc.h:5,
                 from desc_client.h:4,
                 from questlua_monarch.cpp:6:
packet.h:2455:7: warning: no newline at end of file
compile questlua_party.cpp
compile questlua_pc.cpp
compile questlua_quest.cpp
In file included from packet_info.h:4,
                 from input.h:4,
                 from desc.h:5,
                 from questlua_party.cpp:4:
packet.h:2455:7: warning: no newline at end of file
compile questlua_target.cpp
In file included from packet_info.h:4,
                 from input.h:4,
                 from p2p.h:7,
                 from questlua_pc.cpp:17:
packet.h:2455:7: warning: no newline at end of file
compile questmanager.cpp
compile questnpc.cpp
In file included from questmanager.cpp:5:
packet.h:2455:7: warning: no newline at end of file
compile questpc.cpp
compile refine.cpp
compile regen.cpp
questlua_npc.cpp: In function 'int quest::npc_get_vid_attack_mul(lua_State*)':
questlua_npc.cpp:293: warning: unused variable 'q'
questlua_npc.cpp: In function 'int quest::npc_set_vid_attack_mul(lua_State*)':
questlua_npc.cpp:309: warning: unused variable 'q'
questlua_npc.cpp: In function 'int quest::npc_get_vid_damage_mul(lua_State*)':
questlua_npc.cpp:324: warning: unused variable 'q'
questlua_npc.cpp: In function 'int quest::npc_set_vid_damage_mul(lua_State*)':
questlua_npc.cpp:340: warning: unused variable 'q'
compile safebox.cpp
In file included from questpc.cpp:4:
packet.h:2455:7: warning: no newline at end of file
compile sectree.cpp
In file included from safebox.cpp:5:
packet.h:2455:7: warning: no newline at end of file
compile sectree_manager.cpp
compile sequence.cpp
In file included from packet_info.h:4,
                 from input.h:4,
                 from desc.h:5,
                 from sectree_manager.cpp:10:
packet.h:2455:7: warning: no newline at end of file
compile shop.cpp
compile skill.cpp
In file included from sectree.cpp:9:
packet.h:2455:7: warning: no newline at end of file
compile start_position.cpp
In file included from packet_info.h:4,
                 from input.h:4,
                 from desc.h:5,
                 from shop.cpp:7:
packet.h:2455:7: warning: no newline at end of file
compile target.cpp
questnpc.cpp: In member function 'bool quest::NPC::HandleEvent(quest::PC&, int)':
questnpc.cpp:500: warning: unused variable 'pPC'
compile text_file_loader.cpp
compile trigger.cpp
In file included from packet_info.h:4,
                 from input.h:4,
                 from desc.h:5,
                 from target.cpp:8:
packet.h:2455:7: warning: no newline at end of file
compile utils.cpp
compile vector.cpp
compile war_map.cpp
utils.cpp: In function 'bool WildCaseCmp(const char*, const char*)':
utils.cpp:248: warning: NULL used in arithmetic
utils.cpp:260: warning: NULL used in arithmetic
utils.cpp:274: warning: NULL used in arithmetic
compile wedding.cpp
compile xmas_event.cpp
In file included from packet_info.h:4,
                 from input.h:4,
                 from desc.h:5,
                 from desc_client.h:4,
                 from wedding.cpp:2:
packet.h:2455:7: warning: no newline at end of file
In file included from packet_info.h:4,
                 from input.h:4,
                 from desc.h:5,
                 from war_map.cpp:9:
packet.h:2455:7: warning: no newline at end of file
compile panama.cpp
shop.cpp: In member function 'virtual bool CShop::IsSellingItem(DWORD)':
shop.cpp:576: warning: comparison between signed and unsigned integer expressions
In file included from packet_info.h:4,
                 from input.h:4,
                 from desc.h:5,
                 from xmas_event.cpp:4:
packet.h:2455:7: warning: no newline at end of file
compile threeway_war.cpp
In file included from packet_info.h:4,
                 from input.h:4,
                 from desc.h:5,
                 from panama.cpp:2:
packet.h:2455:7: warning: no newline at end of file
compile version.cpp
compile map_location.cpp
compile auth_brazil.cpp
In file included from packet_info.h:4,
                 from input.h:4,
                 from p2p.h:7,
                 from threeway_war.cpp:7:
packet.h:2455:7: warning: no newline at end of file
compile BlueDragon.cpp
compile BlueDragon_Binder.cpp
compile questlua_dragonlair.cpp
compile DragonLair.cpp
compile HackShield.cpp
In file included from BlueDragon.cpp:18:
packet.h:2455:7: warning: no newline at end of file
compile HackShield_Impl.cpp
compile char_hackshield.cpp
compile skill_power.cpp
In file included from HackShield_Impl.cpp:8:
packet.h:2455:7: warning: no newline at end of file
compile affect.cpp
In file included from packet_info.h:4,
                 from input.h:4,
                 from desc.h:5,
                 from char_hackshield.cpp:10:
packet.h:2455:7: warning: no newline at end of file
compile SpeedServer.cpp
compile questlua_speedserver.cpp
compile XTrapManager.cpp
compile auction_manager.cpp
compile FileMonitor_FreeBSD.cpp
In file included from packet_info.h:4,
                 from input.h:4,
                 from desc.h:5,
                 from XTrapManager.cpp:21:
packet.h:2455:7: warning: no newline at end of file
compile ClientPackageCryptInfo.cpp
compile cipher.cpp
compile buff_on_attributes.cpp
compile check_server.cpp
compile dragon_soul_table.cpp
compile DragonSoul.cpp
compile group_text_parse_tree.cpp
In file included from DragonSoul.cpp:6:
packet.h:2455:7: warning: no newline at end of file
compile char_dragonsoul.cpp
compile questlua_dragonsoul.cpp
In file included from packet_info.h:4,
                 from input.h:4,
                 from desc.h:5,
                 from char_dragonsoul.cpp:4:
packet.h:2455:7: warning: no newline at end of file
group_text_parse_tree.h: In constructor 'CGroupTextParseTreeLoader::CGroupTextParseTreeLoader()':
group_text_parse_tree.h:93: warning: 'CGroupTextParseTreeLoader::m_dwcurLineIndex' will be initialized after
group_text_parse_tree.h:91: warning:   'CGroupNode* CGroupTextParseTreeLoader::m_pRootGroupNode'
group_text_parse_tree.cpp:5: warning:   when initialized here
group_text_parse_tree.cpp: In member function 'bool CGroupTextParseTreeLoader::LoadGroup(CGroupNode*)':
group_text_parse_tree.cpp:99: warning: comparison between signed and unsigned integer expressions
group_text_parse_tree.cpp: In member function 'bool CGroupNode::GetRow(int, const CGroupNode::CGroupNodeRow**) const':
group_text_parse_tree.cpp:206: warning: comparison between signed and unsigned integer expressions
ClientPackageCryptInfo.h: In constructor 'CClientPackageCryptInfo::CClientPackageCryptInfo()':
ClientPackageCryptInfo.h:50: warning: 'CClientPackageCryptInfo::m_pSerializedCryptKeyStream' will be initialized after
ClientPackageCryptInfo.h:48: warning:   'int CClientPackageCryptInfo::m_nCryptKeyPackageCnt'
ClientPackageCryptInfo.cpp:9: warning:   when initialized here
compile shop_manager.cpp
buff_on_attributes.cpp: In member function 'void CBuffOnAttributes::ChangeBuffValue(BYTE)':
buff_on_attributes.cpp:113: warning: unused variable 'old_value'
buff_on_attributes.cpp:114: warning: unused variable 'new_value'
compile shopEx.cpp
In file included from packet_info.h:4,
                 from input.h:4,
                 from desc.h:5,
                 from shop_manager.cpp:7:
packet.h:2455:7: warning: no newline at end of file
compile item_manager_read_tables.cpp
dragon_soul_table.cpp: In member function 'bool DragonSoulTable::ReadAdditionalApplys()':
dragon_soul_table.cpp:223: warning: comparison between signed and unsigned integer expressions
dragon_soul_table.cpp: In member function 'bool DragonSoulTable::CheckApplyNumSettings()':
dragon_soul_table.cpp:283: warning: comparison between signed and unsigned integer expressions
dragon_soul_table.cpp: In member function 'bool DragonSoulTable::CheckWeightTables()':
dragon_soul_table.cpp:311: warning: comparison between signed and unsigned integer expressions
dragon_soul_table.cpp: In member function 'bool DragonSoulTable::CheckRefineGradeTables()':
dragon_soul_table.cpp:343: warning: comparison between signed and unsigned integer expressions
dragon_soul_table.cpp:372: warning: comparison between signed and unsigned integer expressions
dragon_soul_table.cpp: In member function 'bool DragonSoulTable::CheckRefineStepTables()':
dragon_soul_table.cpp:397: warning: comparison between signed and unsigned integer expressions
dragon_soul_table.cpp:427: warning: comparison between signed and unsigned integer expressions
dragon_soul_table.cpp: In member function 'bool DragonSoulTable::CheckRefineStrengthTables()':
dragon_soul_table.cpp:453: warning: comparison between signed and unsigned integer expressions
dragon_soul_table.cpp: In member function 'bool DragonSoulTable::CheckDragonHeartExtTables()':
dragon_soul_table.cpp:494: warning: comparison between signed and unsigned integer expressions
dragon_soul_table.cpp:513: warning: comparison between signed and unsigned integer expressions
dragon_soul_table.cpp:522: warning: comparison between signed and unsigned integer expressions
dragon_soul_table.cpp: In member function 'bool DragonSoulTable::CheckDragonSoulExtTables()':
dragon_soul_table.cpp:545: warning: comparison between signed and unsigned integer expressions
In file included from packet_info.h:4,
                 from input.h:4,
                 from desc.h:5,
                 from shopEx.cpp:7:
packet.h:2455:7: warning: no newline at end of file
compile offline_shop.cpp
group_text_parse_tree.h: In member function 'bool CGroupNode::CGroupNodeRow::GetValue(const std::string&, T&) const [with T = std::string]':
dragon_soul_table.cpp:129:   instantiated from here
group_text_parse_tree.h:220: warning: comparison between signed and unsigned integer expressions
group_text_parse_tree.h: In member function 'bool CGroupNode::CGroupNodeRow::GetValue(const std::string&, T&) const [with T = BYTE]':
dragon_soul_table.cpp:134:   instantiated from here
group_text_parse_tree.h:220: warning: comparison between signed and unsigned integer expressions
group_text_parse_tree.h: In member function 'bool CGroupNode::CGroupNodeRow::GetValue(const std::string&, T&) const [with T = int]':
dragon_soul_table.cpp:201:   instantiated from here
group_text_parse_tree.h:220: warning: comparison between signed and unsigned integer expressions
group_text_parse_tree.h: In member function 'bool CGroupNode::CGroupNodeRow::GetValue(const std::string&, T&) const [with T = float]':
dragon_soul_table.cpp:260:   instantiated from here
group_text_parse_tree.h:220: warning: comparison between signed and unsigned integer expressions
group_text_parse_tree.h: In member function 'bool CGroupNode::CGroupNodeRow::GetValue(int, T&) const [with T = float]':
dragon_soul_table.cpp:828:   instantiated from here
group_text_parse_tree.h:228: warning: comparison between signed and unsigned integer expressions
../../../Extern/include/cryptopp/algparam.h: In constructor 'CryptoPP::ConstByteArrayParameter::ConstByteArrayParameter(const T&, bool) [with T = std::basic_string<char, std::char_traits<char>, std::allocator<char> >]':
../../../Extern/include/cryptopp/filters.h:793:   instantiated from here
../../../Extern/include/cryptopp/algparam.h:26: warning: unused variable 'cryptopp_assert_26'
DragonSoul.cpp: In function 'int Gamble(std::vector<float, std::allocator<float> >&)':
DragonSoul.cpp:19: warning: comparison between signed and unsigned integer expressions
DragonSoul.cpp:25: warning: comparison between signed and unsigned integer expressions
DragonSoul.cpp: In member function 'bool DSManager::RefreshItemAttributes(CItem*)':
DragonSoul.cpp:203: warning: comparison between signed and unsigned integer expressions
DragonSoul.cpp: In member function 'bool DSManager::PutAttributes(CItem*)':
DragonSoul.cpp:273: warning: comparison between signed and unsigned integer expressions
DragonSoul.cpp: In member function 'bool DSManager::ExtractDragonHeart(CHARACTER*, CItem*, CItem*)':
DragonSoul.cpp:350: warning: unused variable 'sum'
DragonSoul.cpp: In member function 'bool DSManager::PullOut(CHARACTER*, TItemPos, CItem*&, CItem*)':
DragonSoul.cpp:435: warning: unused variable 'dwVnum'
DragonSoul.cpp:469: warning: format '%d' expects type 'int', but argument 3 has type 'double'
DragonSoul.cpp:469: warning: format '%d' expects type 'int', but argument 4 has type 'double'
DragonSoul.cpp: In member function 'bool DSManager::DoRefineGrade(CHARACTER*, TItemPos (&)[15])':
DragonSoul.cpp:555: warning: unused variable 'prob_sum'
DragonSoul.cpp: In member function 'bool DSManager::DoRefineStep(CHARACTER*, TItemPos (&)[15])':
DragonSoul.cpp:763: warning: unused variable 'sum'
group_text_parse_tree.h: In member function 'bool CGroupNode::CGroupNodeRow::GetValue(int, T&) const [with T = int]':
group_text_parse_tree.h:159:   instantiated from 'bool CGroupNode::GetValue(const std::string&, const std::string&, T&) const [with T = int]'
group_text_parse_tree.h:203:   instantiated from 'bool CGroupNode::GetGroupValue(const std::string&, const std::string&, const std::string&, T&) const [with T = int]'
dragon_soul_table.cpp:612:   instantiated from here
group_text_parse_tree.h:228: warning: comparison between signed and unsigned integer expressions
group_text_parse_tree.h: In member function 'bool CGroupNode::CGroupNodeRow::GetValue(int, T&) const [with T = unsigned int]':
group_text_parse_tree.h:159:   instantiated from 'bool CGroupNode::GetValue(const std::string&, const std::string&, T&) const [with T = unsigned int]'
group_text_parse_tree.h:203:   instantiated from 'bool CGroupNode::GetGroupValue(const std::string&, const std::string&, const std::string&, T&) const [with T = unsigned int]'
dragon_soul_table.cpp:884:   instantiated from here
group_text_parse_tree.h:228: warning: comparison between signed and unsigned integer expressions
char_dragonsoul.cpp: In member function 'bool CHARACTER::DragonSoul_ActivateDeck(int)':
char_dragonsoul.cpp:91: warning: control reaches end of non-void function
compile offlineshop_manager.cpp
../../../Extern/include/cryptopp/algparam.h: In member function 'void CryptoPP::AlgorithmParametersTemplate<T>::MoveInto(void*) const [with T = CryptoPP::RandomNumberGenerator*]':
cipher.cpp:397:   instantiated from here
../../../Extern/include/cryptopp/algparam.h:322: warning: unused variable 'p'
compile offlineshop_config.cpp
In file included from packet_info.h:4,
                 from input.h:4,
                 from desc.h:5,
                 from desc_client.h:4,
                 from item_manager_read_tables.cpp:6:
packet.h:2455:7: warning: no newline at end of file
In file included from packet_info.h:4,
                 from input.h:4,
                 from desc.h:5,
                 from offline_shop.cpp:12:
packet.h:2455:7: warning: no newline at end of file
In file included from offlineshop_config.cpp:7:
offlineshop_config.h:19:7: warning: no newline at end of file
offlineshop_config.cpp:239:2: warning: no newline at end of file
compile main.cpp
In file included from packet_info.h:4,
                 from input.h:4,
                 from desc.h:5,
                 from offlineshop_manager.cpp:7:
packet.h:2455:7: warning: no newline at end of file
In file included from main.cpp:4:
offlineshop_config.h:19:7: warning: no newline at end of file
In file included from main.cpp:7:
packet.h:2455:7: warning: no newline at end of file
compile minilzo.c
item_manager_read_tables.cpp: In member function 'bool ITEM_MANAGER::ReadMonsterDropItemGroup(const char*)':
item_manager_read_tables.cpp:637: warning: unused variable 'pkGroup'
In file included from offlineshop_manager.cpp:29:
offlineshop_config.h:19:7: warning: no newline at end of file
shop_manager.cpp: In function 'bool ConvertToShopItemTable(CGroupNode*, TShopTableEx&)':
shop_manager.cpp:473: warning: comparison between signed and unsigned integer expressions
group_text_parse_tree.h: In member function 'bool CGroupNode::CGroupNodeRow::GetValue(int, T&) const [with T = unsigned int]':
group_text_parse_tree.h:175:   instantiated from 'bool CGroupNode::GetValue(const std::string&, int, T&) const [with T = DWORD]'
shop_manager.cpp:381:   instantiated from here
group_text_parse_tree.h:228: warning: comparison between signed and unsigned integer expressions
group_text_parse_tree.h: In member function 'bool CGroupNode::CGroupNodeRow::GetValue(int, T&) const [with T = std::basic_string<char, std::char_traits<char>, std::allocator<char> >]':
group_text_parse_tree.h:175:   instantiated from 'bool CGroupNode::GetValue(const std::string&, int, T&) const [with T = std::string]'
shop_manager.cpp:387:   instantiated from here
group_text_parse_tree.h:228: warning: comparison between signed and unsigned integer expressions
group_text_parse_tree.h: In member function 'bool CGroupNode::CGroupNodeRow::GetValue(int, T&) const [with T = unsigned char]':
group_text_parse_tree.h:136:   instantiated from 'bool CGroupNode::GetValue(size_t, const std::string&, T&) const [with T = BYTE]'
shop_manager.cpp:442:   instantiated from here
group_text_parse_tree.h:228: warning: comparison between signed and unsigned integer expressions
group_text_parse_tree.h: In member function 'bool CGroupNode::CGroupNodeRow::GetValue(int, T&) const [with T = long long int]':
group_text_parse_tree.h:136:   instantiated from 'bool CGroupNode::GetValue(size_t, const std::string&, T&) const [with T = long long int]'
shop_manager.cpp:447:   instantiated from here
group_text_parse_tree.h:228: warning: comparison between signed and unsigned integer expressions
item_manager_read_tables.cpp:627: warning: 'pkGroup' may be used uninitialized in this function
../../../Extern/include/cryptopp/misc.h: At global scope:
../../../Extern/include/cryptopp/misc.h:548: warning: 'std::string CryptoPP::StringNarrow(const wchar_t*, bool)' defined but not used
linking ../game_r40250_32....
Tot o eroare nu? Merge sa verific fara reboot?
Continut: Ascuns
Trebuie sa multumesti autorului pentru a putea vedea mesajul.
Afișează semnătura
Avatar utilizator
F-l-o-r-i-n
Nivel 3

Nivel 3
Mesaje: 320
Membru din: 12 Ian 2018, 14:07
Server: Thrones2
Regat: Chunjo
Aprecieri: 44  
Mulţumiri: 713  
Medalii

ti-a dat linking ../game_r40250_32.... , deci ar trebui sa-ti apara game-ul
Avatar utilizator
Marius Dragomir
Membru Club

Membru Club
Mesaje: 1020
Membru din: 13 Noi 2017, 21:32
Server: HellHound
Regat: Jinno
Aprecieri: 499  
Mulţumiri: 1211  
Discord: Copiază ID
Medalii

Adrian1428 scrie:ti-a dat linking ../game_r40250_32.... , deci ar trebui sa-ti apara game-ul
Deci eu ar trebuii sa dau doar un simplu reboot acum? Sau trebuie instalat game? Daca da de unde il iau, scuze, sunt cam nou prin chestia asta si nu ma pricep prea bine
Pentru acest mesaj, Marius Dragomir for the post:
alexandu91
Continut: Ascuns
Trebuie sa multumesti autorului pentru a putea vedea mesajul.
Afișează semnătura
Avatar utilizator
F-l-o-r-i-n
Nivel 3

Nivel 3
Mesaje: 320
Membru din: 12 Ian 2018, 14:07
Server: Thrones2
Regat: Chunjo
Aprecieri: 44  
Mulţumiri: 713  
Medalii

unde ai fisierele .cpp acolo e si game-ul de ex ai game/src , game-ul il gasesti in folderul game, il iei de acolo si il bagi in serverfiles, la fel si db
Avatar utilizator
Marius Dragomir
Membru Club

Membru Club
Mesaje: 1020
Membru din: 13 Noi 2017, 21:32
Server: HellHound
Regat: Jinno
Aprecieri: 499  
Mulţumiri: 1211  
Discord: Copiază ID
Medalii

Adrian1428 scrie:unde ai fisierele .cpp acolo e si game-ul de ex ai game/src , game-ul il gasesti in folderul game, il iei de acolo si il bagi in serverfiles, la fel si db
Am gasit ceva de genul, dar la db nu gasesc Imagine Dar nu e in format .tar sau cum ar trebuii procedat?
Continut: Ascuns
Trebuie sa multumesti autorului pentru a putea vedea mesajul.
Afișează semnătura
Avatar utilizator
Marius Dragomir
Membru Club

Membru Club
Mesaje: 1020
Membru din: 13 Noi 2017, 21:32
Server: HellHound
Regat: Jinno
Aprecieri: 499  
Mulţumiri: 1211  
Discord: Copiază ID
Medalii

Am descoperit cum trebuie sa fac, insa dupa ce dau reboot si pornesc serverul nu se mai deschid ch-urile, erroarea din syslog este cea cu map sectree, ca si cum ar fi o problema la mob_drop
Continut: Ascuns
Trebuie sa multumesti autorului pentru a putea vedea mesajul.
Afișează semnătura
Închis
Răspunsuri
1
Vizualizări
105
Răspunsuri
14
Vizualizări
2213
Răspunsuri
2
Vizualizări
337
Răspunsuri
1
Vizualizări
216

Înapoi la “Arhivă Probleme şi Întrebări”

  • Informaţie
  • Cine este conectat

    Utilizatori ce ce navighează pe acest forum: Bing [Bot], Semrush [Bot] și 153 vizitatori