../../common/stl.h:99:32: error: expected ')' before 'a'
../../common/stl.h:99:32: error: expected ')' before 'a'
../../common/stl.h:104:32: error: expected ')' before 'a'
template <typename T> T MAX(T a, T b)
../../common/stl.h:99:32: error: expected ')' before 'a'
../../common/stl.h:104:32: error: expected ')' before 'a'
template <typename T> T MAX(T a, T b)
Tipologie server:Pvm
*Resursă folosită:2009 clean
*ServerFiles utilizat:2009 clean
*Syserr:
In file included from ../../../k3nnthd/boost/predef/os/bsd/free.h:37:0,
from ../../../k3nnthd/boost/predef/os/bsd.h:96,
from ../../../k3nnthd/boost/predef/os/bsd/dragonfly.h:11,
from ../../../k3nnthd/boost/predef/os/bsd.h:95,
from ../../../k3nnthd/boost/predef/os/bsd/bsdi.h:11,
from ../../../k3nnthd/boost/predef/os/bsd.h:52,
from ../../../k3nnthd/boost/predef/os.h:18,
from ../../../k3nnthd/boost/predef.h:17,
from ../../../k3nnthd/boost/unordered/detail/fwd.hpp:14,
from ../../../k3nnthd/boost/unordered/detail/implementation.hpp:44,
from ../../../k3nnthd/boost/unordered/detail/map.hpp:6,
from ../../../k3nnthd/boost/unordered/unordered_map.hpp:21,
from ../../../k3nnthd/boost/unordered_map.hpp:17,
from ClientManager.h:5,
from Monarch.cpp:4:
../../common/stl.h:99:32: error: expected ')' before 'a'
template <typename T> T MIN(T a, T b)
^
../../common/stl.h:99:32: error: expected ')' before 'a'
../../common/stl.h:99:32: error: expected ')' before 'a'
../../common/stl.h:104:32: error: expected ')' before 'a'
template <typename T> T MAX(T a, T b)
^
../../common/stl.h:104:32: error: expected ')' before 'a'
../../common/stl.h:104:32: error: expected ')' before 'a'
[OK] Compiling: ClientManagerHorseName.cpp
gmake: *** [Makefile:60: .obj/Monarch.o] Error 1
gmake: *** Waiting for unfinished jobs....
from ../../../k3nnthd/boost/predef/os/bsd.h:96,
from ../../../k3nnthd/boost/predef/os/bsd/dragonfly.h:11,
from ../../../k3nnthd/boost/predef/os/bsd.h:95,
from ../../../k3nnthd/boost/predef/os/bsd/bsdi.h:11,
from ../../../k3nnthd/boost/predef/os/bsd.h:52,
from ../../../k3nnthd/boost/predef/os.h:18,
from ../../../k3nnthd/boost/predef.h:17,
from ../../../k3nnthd/boost/unordered/detail/fwd.hpp:14,
from ../../../k3nnthd/boost/unordered/detail/implementation.hpp:44,
from ../../../k3nnthd/boost/unordered/detail/map.hpp:6,
from ../../../k3nnthd/boost/unordered/unordered_map.hpp:21,
from ../../../k3nnthd/boost/unordered_map.hpp:17,
from ClientManager.h:5,
from Monarch.cpp:4:
../../common/stl.h:99:32: error: expected ')' before 'a'
template <typename T> T MIN(T a, T b)
^
../../common/stl.h:99:32: error: expected ')' before 'a'
../../common/stl.h:99:32: error: expected ')' before 'a'
../../common/stl.h:104:32: error: expected ')' before 'a'
template <typename T> T MAX(T a, T b)
^
../../common/stl.h:104:32: error: expected ')' before 'a'
../../common/stl.h:104:32: error: expected ')' before 'a'
[OK] Compiling: ClientManagerHorseName.cpp
gmake: *** [Makefile:60: .obj/Monarch.o] Error 1
gmake: *** Waiting for unfinished jobs....
Poză:

*Detalii suplimentare:Am versiunea FreeBSD 11.2 32bit gcc49 si am install boost-all



