Compilare sursa

Totalitatea subiectelor care nu respectă regulamentul impus in sectiunea "Probleme şi Întrebări" vor fi stocate aici.
Avatar utilizator
maryus22
Nivel 2

Nivel 2
Mesaje: 184
Membru din: 21 Apr 2018, 22:11
Server: nu mai stiu
Regat: Jinno
Aprecieri: 8  
Mulţumiri: 4  
Medalii

*Problemă:Ma poate ajuta cineva cu aceste erori primite la compilare?
Tipologie server: pvm
*Resursă folosită: 0
*ServerFiles utilizat: 0
*Syserr: 0
Poză:
*Detalii suplimentare:
aceste erori le primesc încercând sa compilez db-ul

Cod: Selectaţi tot

ClientManagerEventFlag.cpp:13:7: error: no member named 'auto_ptr' in namespace
      'std'
        std::auto_ptr<SQLMsg> pmsg(CDBManager::instance().DirectQuery(szQuery));
        ~~~~~^
ClientManagerEventFlag.cpp:13:16: error: unexpected type name 'SQLMsg': expected
      expression
        std::auto_ptr<SQLMsg> pmsg(CDBManager::instance().DirectQuery(szQuery));
                      ^
ClientManagerEventFlag.cpp:13:24: error: use of undeclared identifier 'pmsg'
        std::auto_ptr<SQLMsg> pmsg(CDBManager::instance().DirectQuery(szQuery));
                              ^
ClientManagerEventFlag.cpp:15:20: error: use of undeclared identifier 'pmsg'
        SQLResult* pRes = pmsg->Get();
                          ^
4 errors generated.
gmake: *** [Makefile:55: debug/ClientManagerEventFlag.o] Error 1
aceste erori le primesc încercând sa compilez game

Cod: Selectaţi tot

DragonSoul.cpp:377:11: warning: implicit conversion of NULL constant to 'bool'
      [-Wnull-conversion]
                        return NULL;
                        ~~~~~~ ^~~~
                               false
1 warning generated.

Cod: Selectaţi tot

dding.cpp:55:3: error: member initializer 'm_isSnow' does not name a
      non-static data member or base class
                m_isSnow(false),
                ^~~~~~~~~~~~~~~
1 error generated.
gmake: *** [Makefile:77: debug/wedding.o] Error 1
Avatar utilizator
Moț
Ţepar / Untrusted User

Ţepar / Untrusted User
Mesaje: 2825
Membru din: 03 Apr 2017, 15:00
Aprecieri: 216  
Mulţumiri: 3040  
Discord: Copiază ID
Medalii

Lasa acele fisiere pe pastebin.com si ti le rezolv.
Imagine
Afișează semnătura
Avatar utilizator
maryus22
Nivel 2

Nivel 2
Mesaje: 184
Membru din: 21 Apr 2018, 22:11
Server: nu mai stiu
Regat: Jinno
Aprecieri: 8  
Mulţumiri: 4  
Medalii

Moț scrie:Lasa acele fisiere pe pastebin.com si ti le rezolv.
ClientManagerEventFlag.cpp
DragonSoul.cpp
wedding.cpp
Le ai in pastebin pe toate
Avatar utilizator
Moț
Ţepar / Untrusted User

Ţepar / Untrusted User
Mesaje: 2825
Membru din: 03 Apr 2017, 15:00
Aprecieri: 216  
Mulţumiri: 3040  
Discord: Copiază ID
Medalii

ClientManagerEventFlag.cpp
DragonSoul.cpp
wedding.cpp
Imagine
Afișează semnătura
Avatar utilizator
maryus22
Nivel 2

Nivel 2
Mesaje: 184
Membru din: 21 Apr 2018, 22:11
Server: nu mai stiu
Regat: Jinno
Aprecieri: 8  
Mulţumiri: 4  
Medalii

Moț scrie: ClientManagerEventFlag.cpp
DragonSoul.cpp
wedding.cpp
db

Cod: Selectaţi tot

In file included from ./ClientManager.h:8:
./../../stl.h:96:32: error: expected ')'
        template <typename T> T MIN(T a, T b)
                                      ^
./../../stl.h:96:26: note: to match this '('
        template <typename T> T MIN(T a, T b)
                                ^
/usr/include/sys/param.h:303:20: note: expanded from macro 'MIN'
#define MIN(a,b) (((a)<(b))?(a):(b))
                   ^
In file included from Monarch.cpp:4:
In file included from ./ClientManager.h:8:
./../../stl.h:96:26: error: expected ')'
        template <typename T> T MIN(T a, T b)
                                ^
/usr/include/sys/param.h:303:23: note: expanded from macro 'MIN'
#define MIN(a,b) (((a)<(b))?(a):(b))
                      ^
./../../stl.h:96:26: note: to match this '('
/usr/include/sys/param.h:303:19: note: expanded from macro 'MIN'
#define MIN(a,b) (((a)<(b))?(a):(b))
                  ^
In file included from Monarch.cpp:4:
In file included from ./ClientManager.h:8:
./../../stl.h:96:26: error: expected ')'
        template <typename T> T MIN(T a, T b)
                                ^
/usr/include/sys/param.h:303:28: note: expanded from macro 'MIN'
#define MIN(a,b) (((a)<(b))?(a):(b))
                           ^
./../../stl.h:96:26: note: to match this '('
/usr/include/sys/param.h:303:18: note: expanded from macro 'MIN'
#define MIN(a,b) (((a)<(b))?(a):(b))
                 ^
In file included from Monarch.cpp:4:
In file included from ./ClientManager.h:8:
./../../stl.h:98:3: error: expected expression
                return a < b ? a : b;
                ^
./../../stl.h:99:3: error: expected ';' at end of declaration
        }
         ^
         ;
./../../stl.h:101:32: error: expected ')'
        template <typename T> T MAX(T a, T b)
                                      ^
./../../stl.h:101:26: note: to match this '('
        template <typename T> T MAX(T a, T b)
                                ^
/usr/include/sys/param.h:304:20: note: expanded from macro 'MAX'
#define MAX(a,b) (((a)>(b))?(a):(b))
                   ^
In file included from Monarch.cpp:4:
In file included from ./ClientManager.h:8:
./../../stl.h:101:26: error: expected ')'
        template <typename T> T MAX(T a, T b)
                                ^
/usr/include/sys/param.h:304:23: note: expanded from macro 'MAX'
#define MAX(a,b) (((a)>(b))?(a):(b))
                      ^
./../../stl.h:101:26: note: to match this '('
/usr/include/sys/param.h:304:19: note: expanded from macro 'MAX'
#define MAX(a,b) (((a)>(b))?(a):(b))
                  ^
In file included from Monarch.cpp:4:
In file included from ./ClientManager.h:8:
./../../stl.h:101:26: error: expected ')'
        template <typename T> T MAX(T a, T b)
                                ^
/usr/include/sys/param.h:304:28: note: expanded from macro 'MAX'
#define MAX(a,b) (((a)>(b))?(a):(b))
                           ^
./../../stl.h:101:26: note: to match this '('
/usr/include/sys/param.h:304:18: note: expanded from macro 'MAX'
#define MAX(a,b) (((a)>(b))?(a):(b))
                 ^
In file included from Monarch.cpp:4:
In file included from ./ClientManager.h:8:
./../../stl.h:101:30: error: redefinition of 'T'
        template <typename T> T MAX(T a, T b)
                                    ^
./../../stl.h:96:30: note: previous definition is here
        template <typename T> T MIN(T a, T b)
                                    ^
./../../stl.h:103:3: error: expected expression
                return a > b ? a : b;
                ^
./../../stl.h:104:3: error: expected ';' at end of declaration
        }
         ^
         ;
11 errors generated.
gmake: *** [Makefile:55: debug/Monarch.o] Error 1
Avatar utilizator
Moț
Ţepar / Untrusted User

Ţepar / Untrusted User
Mesaje: 2825
Membru din: 03 Apr 2017, 15:00
Aprecieri: 216  
Mulţumiri: 3040  
Discord: Copiază ID
Medalii

adauga
#undef MIN
#undef MAX
in common/stl.h
Imagine
Afișează semnătura
Avatar utilizator
maryus22
Nivel 2

Nivel 2
Mesaje: 184
Membru din: 21 Apr 2018, 22:11
Server: nu mai stiu
Regat: Jinno
Aprecieri: 8  
Mulţumiri: 4  
Medalii

Moț scrie:adauga
#undef MIN
#undef MAX
in common/stl.h
in common nu am niciun fisier numit stl.h....Uite...
Avatar utilizator
Moț
Ţepar / Untrusted User

Ţepar / Untrusted User
Mesaje: 2825
Membru din: 03 Apr 2017, 15:00
Aprecieri: 216  
Mulţumiri: 3040  
Discord: Copiază ID
Medalii

sau unde ai stl.h in sursa
Imagine
Afișează semnătura
Avatar utilizator
maryus22
Nivel 2

Nivel 2
Mesaje: 184
Membru din: 21 Apr 2018, 22:11
Server: nu mai stiu
Regat: Jinno
Aprecieri: 8  
Mulţumiri: 4  
Medalii

Moț scrie:sau unde ai stl.h in sursa
stl.h
Avatar utilizator
Moț
Ţepar / Untrusted User

Ţepar / Untrusted User
Mesaje: 2825
Membru din: 03 Apr 2017, 15:00
Aprecieri: 216  
Mulţumiri: 3040  
Discord: Copiază ID
Medalii

http://prntscr.com/mxfurh
adauga acolo
#undef MIN
#undef MAX
Imagine
Afișează semnătura
Închis

Înapoi la “Arhivă Probleme şi Întrebări”

  • Informaţie
  • Cine este conectat

    Utilizatori ce ce navighează pe acest forum: Baidu [Spider] și 122 vizitatori