Eroare compilare sursa client Mob Target System

Totalitatea subiectelor care nu respectă regulamentul impus in sectiunea "Probleme şi Întrebări" vor fi stocate aici.
Închis
Avatar utilizator
Z I C K
Ţepar / Untrusted User

Ţepar / Untrusted User
Mesaje: 268
Membru din: 26 Dec 2013, 20:11
Regat: Jinno
Aprecieri: 183  
Mulţumiri: 789  
Discord: Copiază ID
Medalii

*Problemă/Întrebare: Primesc eroare la compilare client
Tipologie server: -
*Resursă folosită: sursa/mob-target-system-t54126.html
*ServerFiles utilizat: -
*Syserr:1>------ Build started: Project: UserInterface, Configuration: Distribute Win32 ------
1>AccountConnector.cpp
1>NetworkActorManager.cpp
1>..\..\source\UserInterface\NetworkActorManager.cpp(367): warning C4800: 'BOOL' : forcing value to bool 'true' or 'false' (performance warning)
1>..\..\source\UserInterface\NetworkActorManager.cpp(417): warning C4800: 'BOOL' : forcing value to bool 'true' or 'false' (performance warning)
1>PythonEventManager.cpp
1>PythonNetworkStream.cpp
1>..\..\source\UserInterface\PythonNetworkStream.cpp(181): error C2065: 'TPacketGCDamageInfo' : undeclared identifier
1>..\..\source\UserInterface\PythonNetworkStream.cpp(181): error C2070: 'unknown-type': illegal sizeof operand
1>PythonNetworkStreamCommand.cpp
1>PythonNetworkStreamModule.cpp
1>PythonNetworkStreamPhaseGame.cpp
1>..\..\source\UserInterface\PythonNetworkStreamPhaseGame.cpp(868): error C2144: syntax error : 'bool' should be preceded by ';'
1>..\..\source\UserInterface\PythonNetworkStreamPhaseGame.cpp(868): error C2761: 'bool CPythonNetworkStream::RecvObserverAddPacket(void)' : member function redeclaration not allowed
1>..\..\source\UserInterface\PythonNetworkStreamPhaseGame.cpp(2346): error C2065: 'TPacketGCDamageInfo' : undeclared identifier
1>..\..\source\UserInterface\PythonNetworkStreamPhaseGame.cpp(2346): error C2146: syntax error : missing ';' before identifier 'DamageInfoPacket'
1>..\..\source\UserInterface\PythonNetworkStreamPhaseGame.cpp(2346): error C2065: 'DamageInfoPacket' : undeclared identifier
1>..\..\source\UserInterface\PythonNetworkStreamPhaseGame.cpp(2348): error C2065: 'TPacketGCDamageInfo' : undeclared identifier
1>..\..\source\UserInterface\PythonNetworkStreamPhaseGame.cpp(2348): error C2070: 'unknown-type': illegal sizeof operand
1>..\..\source\UserInterface\PythonNetworkStreamPhaseGame.cpp(2348): error C2065: 'DamageInfoPacket' : undeclared identifier
1>..\..\source\UserInterface\PythonNetworkStreamPhaseGame.cpp(2354): error C2065: 'DamageInfoPacket' : undeclared identifier
1>..\..\source\UserInterface\PythonNetworkStreamPhaseGame.cpp(2354): error C2228: left of '.dwVID' must have class/struct/union
1> type is 'unknown-type'
1>..\..\source\UserInterface\PythonNetworkStreamPhaseGame.cpp(2359): error C2065: 'DamageInfoPacket' : undeclared identifier
1>..\..\source\UserInterface\PythonNetworkStreamPhaseGame.cpp(2359): error C2228: left of '.damage' must have class/struct/union
1> type is 'unknown-type'
1>..\..\source\UserInterface\PythonNetworkStreamPhaseGame.cpp(2360): error C2065: 'DamageInfoPacket' : undeclared identifier
1>..\..\source\UserInterface\PythonNetworkStreamPhaseGame.cpp(2360): error C2228: left of '.damage' must have class/struct/union
1> type is 'unknown-type'
1>..\..\source\UserInterface\PythonNetworkStreamPhaseGame.cpp(2360): error C2228: left of '.flag' must have class/struct/union
1> type is 'unknown-type'
1>..\..\source\UserInterface\PythonNetworkStreamPhaseGame.cpp(2360): error C2660: 'CInstanceBase::AddDamageEffect' : function does not take 3 arguments
1>..\..\source\UserInterface\PythonNetworkStreamPhaseGame.cpp(2406): error C2144: syntax error : 'bool' should be preceded by ';'
1>..\..\source\UserInterface\PythonNetworkStreamPhaseGame.cpp(2406): error C2761: 'bool CPythonNetworkStream::RecvTargetPacket(void)' : member function redeclaration not allowed
1>PythonNetworkStreamPhaseGameActor.cpp
1>Done building project "UserInterface.vcxproj" -- FAILED.
========== Build: 0 succeeded, 1 failed, 15 up-to-date, 0 skipped ==========
Poză:
*Detalii suplimentare: Problema este la PythonNetworkStreamPhaseGame.cpp, am editat-o corect si tot ma opreste sa ii dau build solution. Oare care ar fi problema?
The Golden Boy
Afișează semnătura
Avatar utilizator
Ionuţ M.
Metin Master

Metin Master
Mesaje: 2680
Membru din: 28 Noi 2015, 22:02
Aprecieri: 170  
Mulţumiri: 12723  
  Rezolvări prob.: 2
Discord: Copiază ID
 Contact:
Medalii

Subiect inactiv,arhivat.
Imagine
Afișează semnătura
Închis

Înapoi la “Arhivă Probleme şi Întrebări”

  • Informaţie
  • Cine este conectat

    Utilizatori ce ce navighează pe acest forum: Niciun utilizator înregistrat și 64 vizitatori