[Compilat] char_item.cpp
[Compilat] event.cpp
[Compilat] event_queue.cpp
[Compilat] exchange.cpp
[Compilat] file_loader.cpp
[Compilat] fishing.cpp
[Compilat] gm.cpp
[Compilat] guild.cpp
[Compilat] guild_manager.cpp
[Compilat] guild_war.cpp
char_item.cpp: In member function 'bool CHARACTER::UseItemEx(CItem*, TItemPos)':
char_item.cpp

error: 'item2' was not declared in this scope
char_item.cpp:4130: error: duplicate case value
char_item.cpp

error: previously used here
char_item.cpp:4137: error: duplicate case value
char_item.cpp

error: previously used here
char_item.cpp:4327: error: duplicate case value
char_item.cpp

error: previously used here
char_item.cpp:4403: error: duplicate case value
char_item.cpp

error: previously used here
char_item.cpp:4493: error: duplicate case value
char_item.cpp

error: previously used here
char_item.cpp:4539: error: duplicate case value
char_item.cpp

error: previously used here
char_item.cpp:4540: error: duplicate case value
char_item.cpp

error: previously used here
char_item.cpp:4541: error: duplicate case value
char_item.cpp

error: previously used here
char_item.cpp:4542: error: duplicate case value
char_item.cpp

error: previously used here
char_item.cpp:4543: error: duplicate case value
char_item.cpp

error: previously used here
char_item.cpp:4544: error: duplicate case value
char_item.cpp

error: previously used here
char_item.cpp:4545: error: duplicate case value
char_item.cpp

error: previously used here
char_item.cpp:4546: error: duplicate case value
char_item.cpp

error: previously used here
char_item.cpp:4547: error: duplicate case value
char_item.cpp

error: previously used here
char_item.cpp:4957: error: duplicate case value
char_item.cpp

error: previously used here
char_item.cpp:4995: error: duplicate case value
char_item.cpp

error: previously used here
char_item.cpp:5064: error: break statement not within loop or switch
char_item.cpp:5066: error: case label 'ITEM_METIN' not within a switch statement
char_item.cpp:5145: error: break statement not within loop or switch
char_item.cpp:5147: error: case label 'ITEM_AUTOUSE' not within a switch statement
char_item.cpp:5148: error: case label 'ITEM_MATERIAL' not within a switch statement
char_item.cpp:5149: error: case label 'ITEM_SPECIAL' not within a switch statement
char_item.cpp:5150: error: case label 'ITEM_TOOL' not within a switch statement
char_item.cpp:5151: error: case label 'ITEM_LOTTERY' not within a switch statement
char_item.cpp:5152: error: break statement not within loop or switch
char_item.cpp:5154: error: case label 'ITEM_TOTEM' not within a switch statement
char_item.cpp:5159: error: break statement not within loop or switch
char_item.cpp:5161: error: case label 'ITEM_BLEND' not within a switch statement
char_item.cpp:5196: error: break statement not within loop or switch
char_item.cpp:5197: error: case label 'ITEM_EXTRACT' not within a switch statement
char_item.cpp:5222: error: break statement not within loop or switch
char_item.cpp:5224: error: case label 'ITEM_NONE' not within a switch statement
char_item.cpp:5226: error: break statement not within loop or switch
char_item.cpp:5228: error: case label not within a switch statement
char_item.cpp: At global scope:
char_item.cpp:5233: error: expected unqualified-id before 'return'
char_item.cpp:5234: error: expected declaration before '}' token
[Compilat] horse_rider.cpp
[Compilat] horsename_manager.cpp
char_item.cpp:82: warning: 'bool IS_SUMMON_ITEM(int)' defined but not used
char_item.cpp:170: warning: 'bool FN_check_item_socket(CItem*)' defined but not used
char_item.cpp:182: warning: 'void FN_copy_item_socket(CItem*, CItem*)' defined but not used
char_item.cpp:189: warning: 'bool FN_check_item_sex(CHARACTER*, CItem*)' defined but not used
gmake: *** [OBJDIR/char_item.o] Error 1
gmake: *** Waiting for unfinished jobs....