Tipologie server: PvM Easy
*Resursă folosită: - mailine
*ServerFiles utilizat: - mailine
*Syserr:
compile char_manager.cpp
char.cpp: In member function 'void CHARACTER::UpdateShopItems()':
char.cpp:8183: warning: comparison is always false due to limited range of data type
char.cpp: In member function 'void CHARACTER::OpenShop(DWORD, const char*, bool)':
char.cpp:8357: warning: comparison is always false due to limited range of data type
char.cpp: In member function 'void CHARACTER::UpdateShopItems()':
char.cpp:8183: warning: comparison is always false due to limited range of data type
char.cpp: In member function 'void CHARACTER::OpenShop(DWORD, const char*, bool)':
char.cpp:8357: warning: comparison is always false due to limited range of data type
*Detalii suplimentare: Nu prea inteleg eroarea. M-am tot uitat la linii si nu prea vad nimic la ele, adica nu inteleg
Este singura eroare ca o am in sursa.(MOMENTAN)
Precizez ca ce instalez, fac o comparare la alte surse de pe net.
Si a doua problema
Modific la title sistem astea:
#define need_minutes_1 600
#define need_minutes_2 1600
#define need_minutes_3 1700
#define need_minutes_4 1800
#define need_minutes_5 1900
#define need_minutes_6 2000
#define need_minutes_7 2100
#define need_minutes_8 2200
#define need_minutes_9 2300
#define need_minutes_10 2400
#define need_minutes_11 2500
#define need_minutes_12 2600
#define need_minutes_13 2700
#define need_minutes_14 2800
#define need_minutes_15 2900
#define need_minutes_16 3000
#define need_minutes_2 1600
#define need_minutes_3 1700
#define need_minutes_4 1800
#define need_minutes_5 1900
#define need_minutes_6 2000
#define need_minutes_7 2100
#define need_minutes_8 2200
#define need_minutes_9 2300
#define need_minutes_10 2400
#define need_minutes_11 2500
#define need_minutes_12 2600
#define need_minutes_13 2700
#define need_minutes_14 2800
#define need_minutes_15 2900
#define need_minutes_16 3000
#define need_level_1 15
#define need_level_2 75
#define need_level_3 75
#define need_level_4 75
#define need_level_5 75
#define need_level_6 75
#define need_level_7 75
#define need_level_8 75
#define need_level_9 75
#define need_level_10 75
#define need_level_11 75
#define need_level_12 75
#define need_level_13 75
#define need_level_14 75
#define need_level_15 75
#define need_level_16 75
#define need_level_2 75
#define need_level_3 75
#define need_level_4 75
#define need_level_5 75
#define need_level_6 75
#define need_level_7 75
#define need_level_8 75
#define need_level_9 75
#define need_level_10 75
#define need_level_11 75
#define need_level_12 75
#define need_level_13 75
#define need_level_14 75
#define need_level_15 75
#define need_level_16 75
#define need_gold_1 5000000
#define need_gold_2 8000000
#define need_gold_3 15000000
#define need_gold_4 18000000
#define need_gold_5 25000000
#define need_gold_6 30000000
#define need_gold_7 40000000
#define need_gold_8 50000000
#define need_gold_9 100000000
#define need_gold_10 150000000
#define need_gold_11 250000000
#define need_gold_12 500000000
#define need_gold_13 750000000
#define need_gold_14 1000000000
#define need_gold_15 1500000000
#define need_gold_16 3000000000
#define need_gold_2 8000000
#define need_gold_3 15000000
#define need_gold_4 18000000
#define need_gold_5 25000000
#define need_gold_6 30000000
#define need_gold_7 40000000
#define need_gold_8 50000000
#define need_gold_9 100000000
#define need_gold_10 150000000
#define need_gold_11 250000000
#define need_gold_12 500000000
#define need_gold_13 750000000
#define need_gold_14 1000000000
#define need_gold_15 1500000000
#define need_gold_16 3000000000
int sPotionPrice[] = {5000, 6000, 7000};
int pTitleBonus_1[] = {POINT_MAX_HP, 5000};
int pTitleBonus_2[] = {POINT_ATTBONUS_MONSTER, 20};
int pTitleBonus_3[] = {POINT_ATTBONUS_HUMAN, 20};
int pTitleBonus_2[] = {POINT_ATTBONUS_MONSTER, 20};
int pTitleBonus_3[] = {POINT_ATTBONUS_HUMAN, 20};
gmake: Warning: File `title.cpp' has modification time 351 s in the future
compile title.cpp
compile New_PetSystem.cpp
title.cpp:364: warning: this decimal constant is unsigned only in ISO C90
title.cpp:577: warning: this decimal constant is unsigned only in ISO C90
title.cpp:579: warning: this decimal constant is unsigned only in ISO C90
compile questlua_petnew.cpp
compile minilzo.c
title.cpp: In function 'bool GetLevel(CHARACTER*, int)':
title.cpp:338: error: duplicate case value
title.cpp:338: error: previously used here
title.cpp:338: error: duplicate case value
title.cpp:338: error: previously used here
title.cpp:339: error: duplicate case value
title.cpp:338: error: previously used here
title.cpp:339: error: duplicate case value
title.cpp:338: error: previously used here
title.cpp:339: error: duplicate case value
title.cpp:338: error: previously used here
title.cpp:339: error: duplicate case value
title.cpp:338: error: previously used here
title.cpp:340: error: duplicate case value
title.cpp:338: error: previously used here
title.cpp:340: error: duplicate case value
title.cpp:338: error: previously used here
title.cpp:340: error: duplicate case value
title.cpp:338: error: previously used here
title.cpp:340: error: duplicate case value
title.cpp:338: error: previously used here
title.cpp:341: error: duplicate case value
title.cpp:338: error: previously used here
title.cpp:341: error: duplicate case value
title.cpp:338: error: previously used here
title.cpp:341: error: duplicate case value
title.cpp:338: error: previously used here
title.cpp:341: error: duplicate case value
title.cpp:338: error: previously used here
gmake: *** [OBJDIR/title.o] Error 1
gmake: *** Waiting for unfinished jobs....
compile title.cpp
compile New_PetSystem.cpp
title.cpp:364: warning: this decimal constant is unsigned only in ISO C90
title.cpp:577: warning: this decimal constant is unsigned only in ISO C90
title.cpp:579: warning: this decimal constant is unsigned only in ISO C90
compile questlua_petnew.cpp
compile minilzo.c
title.cpp: In function 'bool GetLevel(CHARACTER*, int)':
title.cpp:338: error: duplicate case value
title.cpp:338: error: previously used here
title.cpp:338: error: duplicate case value
title.cpp:338: error: previously used here
title.cpp:339: error: duplicate case value
title.cpp:338: error: previously used here
title.cpp:339: error: duplicate case value
title.cpp:338: error: previously used here
title.cpp:339: error: duplicate case value
title.cpp:338: error: previously used here
title.cpp:339: error: duplicate case value
title.cpp:338: error: previously used here
title.cpp:340: error: duplicate case value
title.cpp:338: error: previously used here
title.cpp:340: error: duplicate case value
title.cpp:338: error: previously used here
title.cpp:340: error: duplicate case value
title.cpp:338: error: previously used here
title.cpp:340: error: duplicate case value
title.cpp:338: error: previously used here
title.cpp:341: error: duplicate case value
title.cpp:338: error: previously used here
title.cpp:341: error: duplicate case value
title.cpp:338: error: previously used here
title.cpp:341: error: duplicate case value
title.cpp:338: error: previously used here
title.cpp:341: error: duplicate case value
title.cpp:338: error: previously used here
gmake: *** [OBJDIR/title.o] Error 1
gmake: *** Waiting for unfinished jobs....


