15>..\..\source\UserInterface\UserInterface.cpp(591): error C2601: 'WinMain' : local function definitions are illegal
15> ..\..\source\UserInterface\UserInterface.cpp(588): this line contains a '{' which has not yet been matched
15>..\..\source\UserInterface\UserInterface.cpp(792): error C2267: 'GrannyError' : static functions with block scope are illegal
15>..\..\source\UserInterface\UserInterface.cpp(792): error C2601: 'GrannyError' : local function definitions are illegal
15> ..\..\source\UserInterface\UserInterface.cpp(588): this line contains a '{' which has not yet been matched
15>..\..\source\UserInterface\UserInterface.cpp(797): error C2601: 'Setup' : local function definitions are illegal
15> ..\..\source\UserInterface\UserInterface.cpp(588): this line contains a '{' which has not yet been matched
15>..\..\source\UserInterface\UserInterface.cpp(820): fatal error C1075: end of file found before the left brace '{' at '..\..\source\UserInterface\UserInterface.cpp(588)' was matched
========== Build: 14 succeeded, 1 failed, 1 up-to-date, 0 skipped ==========