Problema Implementare Weapon Costume

Totalitatea subiectelor care nu respectă regulamentul impus in sectiunea "Probleme şi Întrebări" vor fi stocate aici.
Închis
Avatar utilizator
[ZoKu]
Traficant de ouă - 2024

Traficant de ouă - 2024
Mesaje: 292
Membru din: 27 Noi 2016, 12:29
Server: Arcadia
Regat: Jinno
Aprecieri: 275  
Mulţumiri: 394  
  Rezolvări prob.: 3
Discord: Copiază ID
 Contact:
Medalii

Salut , tot e bine , il instalez si cand dau compilare la sursa server am erroarea asta :
char.cpp: In member function 'WORD CHARACTER::GetOriginalPart(BYTE) const':
char.cpp:4142: error: 'PART_ACCE' was not declared in this scope
compile cmd.cpp
gmake: *** [OBJDIR/char.o] Error 1
gmake: *** Waiting for unfinished jobs....
char_item.cpp: In member function 'bool CHARACTER::CanEquipNow(CItem*, const TItemPos&, const TItemPos&)':
char_item.cpp:7496: error: 'COSTUME_WEAPON' was not declared in this scope
gmake: *** [OBJDIR/char_item.o] Error 1
Stie cineva?
Afișează semnătura
Avatar utilizator
KIDDA
Membru Club

Membru Club
Mesaje: 1248
Membru din: 21 Feb 2018, 15:38
Server: KoF2
Aprecieri: 106  
Mulţumiri: 1115  
Medalii

ai dat copy and paste la tot tut in unele parti erau si esarfele trebuia sa iei doar ce era de weapon
Pentru acest mesaj, KIDDA for the post:
nytro123
Discord: KIDDA#4960
Skype: negrea.nicu166
Imagine
Afișează semnătura
Avatar utilizator
KIDDA
Membru Club

Membru Club
Mesaje: 1248
Membru din: 21 Feb 2018, 15:38
Server: KoF2
Aprecieri: 106  
Mulţumiri: 1115  
Medalii

Topic inchis , nerespectare regulament
http://just4metin.ro/probleme/model-pos ... 67107.html
Discord: KIDDA#4960
Skype: negrea.nicu166
Imagine
Afișează semnătura
Închis
Răspunsuri
3
Vizualizări
732
Răspunsuri
6
Vizualizări
698
Răspunsuri
1
Vizualizări
56
Răspunsuri
6
Vizualizări
349

Înapoi la “Arhivă Probleme şi Întrebări”

  • Informaţie
  • Cine este conectat

    Utilizatori ce ce navighează pe acest forum: Niciun utilizator înregistrat și 41 vizitatori