Multumesc tin sa spun ca din cauza acestui fisier nu pot compila gameul.
char.cpp:7222:3: warning: this decimal constant is unsigned only in ISO C90 [enabled by default]
return 2500000000;
^
char.cpp: In member function 'void CHARACTER::PointsPacket()':
char.cpp14: error: 'POINT_PRESTIGE_LEVEL' was not declared in this scope
pack.points[POINT_PRESTIGE_LEVEL] = GetPrestigeLevel();
^
char.cpp55: error: 'GetPrestigeLevel' was not declared in this scope
pack.points[POINT_PRESTIGE_LEVEL] = GetPrestigeLevel();
^
char.cpp: In member function 'int CHARACTER::GetPolymorphPoint(BYTE) const':
char.cpp57: warning: suggest parentheses around '&&' within '||' [-Wparentheses]
if (GetJob() == JOB_SHAMAN || GetJob() == JOB_SURA && GetSkillGroup() == 2)
^
char.cpp: In member function 'void CHARACTER::PointChange(BYTE, int, bool, bool)':
char.cpp30: warning: comparison between signed and unsigned integer expressions [-Wsign-compare]
if (amount < 0 && exp < -amount)
^
char.cpp: In member function 'void CHARACTER::SetTarget(LPCHARACTER)':
char.cpp:5104:29: warning: suggest parentheses around '&&' within '||' [-Wparentheses]
if (m_pkChrTarget->IsPC() && !m_pkChrTarget->IsPolymorphed() || m_pkChrTarget->GetMaxHP() <= 0)
^
char.cpp: In member function 'bool CHARACTER::CanSummon(int)':
char.cpp:6289:49: warning: suggest parentheses around '&&' within '||' [-Wparentheses]
return (iLeaderShip >= 20 || iLeaderShip >= 12 && m_dwLastDeadTime + 180 > get_dword_time());
^
gmake: *** [OBJDIR/char.o] Error 1
gmake: *** Waiting for unfinished jobs....




