Cod: Selectaţi tot
exchange.cpp: In member function 'bool CExchange::CheckSpace()':
exchange.cpp:304: error: redeclaration of 'CGrid s_grid1'
exchange.cpp:302: error: 'CGrid s_grid1' previously declared here
exchange.cpp:305: error: redeclaration of 'CGrid s_grid1'
exchange.cpp:302: error: 'CGrid s_grid1' previously declared here
exchange.cpp:309: error: 's_grid3' was not declared in this scope
exchange.cpp:310: error: 's_grid4' was not declared in this scope
gmake: *** [OBJDIR/exchange.o] Error 1
gmake: *** Waiting for unfinished jobs....



