Problemă eșarfe
- Sparowww
-

- Mesaje: 257
- Membru din: 23 Noi 2013, 11:03
- Server: Cronos2
- Regat: Jinno
- Aprecieri: 334
- Mulţumiri: 843
- Discord: Copiază ID
- Contact:
Mă ajută și pe mine cineva să bag eșarfele leam băgat de 4 ori și tot imi dă eroare nu se compilează game..
- Sparowww
-

- Mesaje: 257
- Membru din: 23 Noi 2013, 11:03
- Server: Cronos2
- Regat: Jinno
- Aprecieri: 334
- Mulţumiri: 843
- Discord: Copiază ID
- Contact:
Nimeni ??????
- KinKade
-

- Mesaje: 1224
- Membru din: 10 Mar 2014, 19:39
- Server: Quirin2
- Regat: Jinno
- Aprecieri: 132
- Mulţumiri: 55
- Discord: Copiază ID
- Contact:
PAi ce zice game cand il complieze asa nu stim ce eroare oi avea u acolo
- Sparowww
-

- Mesaje: 257
- Membru din: 23 Noi 2013, 11:03
- Server: Cronos2
- Regat: Jinno
- Aprecieri: 334
- Mulţumiri: 843
- Discord: Copiază ID
- Contact:
Nu mai știu
că am inchis freebsd
- Sparowww
-

- Mesaje: 257
- Membru din: 23 Noi 2013, 11:03
- Server: Cronos2
- Regat: Jinno
- Aprecieri: 334
- Mulţumiri: 843
- Discord: Copiază ID
- Contact:
Am făcut cum e la cartof in sursă și tot nu merge..
shop_manager.h:40:7: warning: no newline at end of file
In file included from char.cpp:62:
PetSystem.h:163:31: warning: no newline at end of file
char.cpp:7231: warning: this decimal constant is unsigned only in ISO C90
char.cpp:7239:2: warning: no newline at end of file
In file included from char_battle.cpp:27:
shop_manager.h:40:7: warning: no newline at end of file
compile char_manager.cpp
In file included from char_item.cpp:47:
belt_inventory_helper.h:108:42: warning: no newline at end of file
compile char_quickslot.cpp
compile char_resist.cpp
compile char_skill.cpp
compile char_state.cpp
compile PetSystem.cpp
In file included from PetSystem.cpp:8:
PetSystem.h:163:31: warning: no newline at end of file
PetSystem.cpp:637:2: warning: no newline at end of file
PetSystem.cpp: In member function 'virtual bool CPetActor::_UpdateFollowAI()':
PetSystem.cpp:246: warning: unused variable 'bDoMoveAlone'
PetSystem.cpp: In member function 'CPetActor* CPetSystem::Summon(DWORD, CItem*, const char*, bool, DWORD)':
PetSystem.cpp:552: warning: unused variable 'petVID'
char_state.cpp: In member function 'virtual void CHARACTER::StateMove()':
char_state.cpp:901: warning: unused variable 'rider'
compile cmd.cpp
compile cmd_emotion.cpp
compile cmd_general.cpp
cmd_emotion.cpp: In function 'bool CHARACTER_CanEmotion(CHARACTER&)':
cmd_emotion.cpp:131: warning: control reaches end of non-void function
compile cmd_gm.cpp
cmd_general.cpp: In function 'void do_costume(CHARACTER*, const char*, int, int)':
cmd_general.cpperror: 'WEAR_COSTUME_ACCE' was not declared in this scope
cmd_gm.cpp9: warning: multi-character character constant
gmake: *** [OBJDIR/cmd_general.o] Error 1
gmake: *** Waiting for unfinished jobs....
cmd_gm.cpp: In function 'void do_set_stat(CHARACTER*, const char*, int, int)':
cmd_gm.cppwarning: NULL used in arithmetic
cmd_gm.cpp: In function 'void do_use_item(CHARACTER*, const char*, int, int)':
cmd_gm.cpp:4353: warning: 'cell' may be used uninitialized in this function
cmd_gm.cpp: In function 'void do_set_stat(CHARACTER*, const char*, int, int)':
cmd_gm.cppwarning: 'n' may be used uninitialized in this function
cmd_gm.cpp: In function 'void do_mob_ld(CHARACTER*, const char*, int, int)':
cmd_gm.cpp:855: warning: 'x' may be used uninitialized in this function
cmd_gm.cpp:855: warning: 'y' may be used uninitialized in this function
char_item.cpp: In member function 'bool CHARACTER::IsEmptyItemGrid(TItemPos, BYTE, int) const':
char_item.cpp:640: warning: comparison is always false due to limited range of data type
char_item.cpp:666: warning: comparison is always false due to limited range of data type
char_item.cpp: In member function 'bool CHARACTER::UseItemEx(CItem*, TItemPos)':
char_item.cppwarning: format '%d' expects type 'int', but argument 6 has type 'long int'
char_item.cppwarning: format '%d' expects type 'int', but argument 6 has type 'long int'
char_item.cppwarning: format '%d' expects type 'int', but argument 5 has type 'long int'
char_item.cppwarning: format '%d' expects type 'int', but argument 5 has type 'long int'
char_item.cppwarning: format '%d' expects type 'int', but argument 6 has type 'long int'
char_item.cppwarning: format '%d' expects type 'int', but argument 5 has type 'long int'
char_item.cpp:4498: error: 'item2' was not declared in this scope
char_item.cpp:4501: error: 'item2' was not declared in this scope
char_item.cpp:4520: error: duplicate case value
char_item.cpperror: previously used here
char_item.cpp:4521: error: duplicate case value
char_item.cpperror: previously used here
char_item.cpp:4522: error: duplicate case value
char_item.cpperror: previously used here
char_item.cpp:4523: error: duplicate case value
char_item.cpperror: previously used here
char_item.cpp:4524: error: duplicate case value
char_item.cpperror: previously used here
char_item.cpp:4525: error: duplicate case value
char_item.cpperror: previously used here
char_item.cpp:4526: error: duplicate case value
char_item.cpperror: previously used here
char_item.cpp:4527: error: duplicate case value
char_item.cpperror: previously used here
char_item.cpp:4528: error: duplicate case value
char_item.cpperror: previously used here
char_item.cpp:4941: error: duplicate case value
char_item.cpperror: previously used here
char_item.cpp:4979: error: duplicate case value
char_item.cpperror: previously used here
char_item.cpp:5048: error: break statement not within loop or switch
char_item.cpp:5050: error: case label 'ITEM_METIN' not within a switch statement
char_item.cpp:5129: error: break statement not within loop or switch
char_item.cpp:5131: error: case label 'ITEM_AUTOUSE' not within a switch statement
char_item.cpp:5132: error: case label 'ITEM_MATERIAL' not within a switch statement
char_item.cpp:5133: error: case label 'ITEM_SPECIAL' not within a switch statement
char_item.cpp:5134: error: case label 'ITEM_TOOL' not within a switch statement
char_item.cpp:5135: error: case label 'ITEM_LOTTERY' not within a switch statement
char_item.cpp:5136: error: break statement not within loop or switch
char_item.cpp:5138: error: case label 'ITEM_TOTEM' not within a switch statement
char_item.cpp:5143: error: break statement not within loop or switch
char_item.cpp:5145: error: case label 'ITEM_BLEND' not within a switch statement
char_item.cpp:5151: warning: comparison between signed and unsigned integer expressions
char_item.cpp:5177: error: break statement not within loop or switch
char_item.cpp:5178: error: case label 'ITEM_EXTRACT' not within a switch statement
char_item.cpp:5203: error: break statement not within loop or switch
char_item.cpp:5205: error: case label 'ITEM_NONE' not within a switch statement
char_item.cpp:5207: error: break statement not within loop or switch
char_item.cpp:5209: error: case label not within a switch statement
char_item.cpp: At global scope:
char_item.cpp:5214: error: expected unqualified-id before 'return'
char_item.cpp:5215: error: expected declaration before '}' token
char_item.cpp:82: warning: 'bool IS_SUMMON_ITEM(int)' defined but not used
char_item.cpp:170: warning: 'bool FN_check_item_socket(CItem*)' defined but not used
char_item.cpp:182: warning: 'void FN_copy_item_socket(CItem*, CItem*)' defined but not used
char_item.cpp:189: warning: 'bool FN_check_item_sex(CHARACTER*, CItem*)' defined but not used
gmake: *** [OBJDIR/char_item.o] Error 1
char.cpp: In member function 'void CHARACTER::PointChange(BYTE, int, bool, bool)':
char.cppwarning: comparison between signed and unsigned integer expressions
- KinKade
-

- Mesaje: 1224
- Membru din: 10 Mar 2014, 19:39
- Server: Quirin2
- Regat: Jinno
- Aprecieri: 132
- Mulţumiri: 55
- Discord: Copiază ID
- Contact:
char_item.cpp:5215: error: expected declaration before '}' token
ai multe erori de neatentie.
char_item.cpp:4522: error: duplicate case value
char_item.cpp
error: previously used here
char_item.cpp:4523: error: duplicate case value
char_item.cpp
error: previously used here
char_item.cpp:4524: error: duplicate case value
char_item.cpp
error: previously used here
char_item.cpp:4525: error: duplicate case value
si multe iar tot de neatentie:)
Implementarile astea nu sunt neaparat ce este acolo bagi si u cateodata sunt diferite sursele si trebuie sa le si intelegi cateodata.
char_item.cpp:4524: error: duplicate case value
char_item.cpp
error: previously used here
Spre exemplu erorile astea iti spun ca la randul 2164 din char_item.cpp este folosita comanda/functia... si u ai vrut sa o mai bagi odata la randul 4524
ai multe erori de neatentie.
char_item.cpp:4522: error: duplicate case value
char_item.cpp
char_item.cpp:4523: error: duplicate case value
char_item.cpp
char_item.cpp:4524: error: duplicate case value
char_item.cpp
char_item.cpp:4525: error: duplicate case value
si multe iar tot de neatentie:)
Implementarile astea nu sunt neaparat ce este acolo bagi si u cateodata sunt diferite sursele si trebuie sa le si intelegi cateodata.
char_item.cpp:4524: error: duplicate case value
char_item.cpp
Spre exemplu erorile astea iti spun ca la randul 2164 din char_item.cpp este folosita comanda/functia... si u ai vrut sa o mai bagi odata la randul 4524
- Sparowww
-

- Mesaje: 257
- Membru din: 23 Noi 2013, 11:03
- Server: Cronos2
- Regat: Jinno
- Aprecieri: 334
- Mulţumiri: 843
- Discord: Copiază ID
- Contact:
Am băgato direct din sursa lui cartof.. și tot nu merge să o compilez
-
- Informaţie
-
Cine este conectat
Utilizatori ce ce navighează pe acest forum: marian261, Semrush [Bot] și 44 vizitatori


