Problema complimare sursa

Totalitatea subiectelor care nu respectă regulamentul impus in sectiunea "Probleme şi Întrebări" vor fi stocate aici.
Închis
Avatar utilizator
D@rkN3Ss
Nivel 2

Nivel 2
Mesaje: 173
Membru din: 29 Mar 2015, 01:49
Regat: Shinsoo
Aprecieri: 14  
Mulţumiri: 0
Medalii

Cod: Selectaţi tot

gmake: *** [dep] Error 127
root@metin68:/usr/src/gazer/Srcs/Server/game/src #
root@metin68:/usr/src/gazer/Srcs/Server/game/src # gmake clean
root@metin68:/usr/src/gazer/Srcs/Server/game/src # gmake -j20
compile BattleArena.cpp
compile FSM.cpp
compile MarkConvert.cpp
compile MarkImage.cpp
compile MarkManager.cpp
compile OXEvent.cpp
compile TrafficProfiler.cpp
compile ani.cpp
compile arena.cpp
compile banword.cpp
compile battle.cpp
compile blend_item.cpp
compile block_country.cpp
compile buffer_manager.cpp
compile building.cpp
compile castle.cpp
compile char.cpp
compile char_affect.cpp
compile char_battle.cpp
compile char_change_empire.cpp
compile char_horse.cpp
cd [dep] Error 127

cd /
compile char_item.cpp
compile char_manager.cpp
compile char_quickslot.cpp
compile char_resist.cpp
compile char_skill.cpp
compile char_state.cpp
compile PetSystem.cpp
compile cmd.cpp
PetSystem.cpp: In member function 'virtual bool CPetActor::_UpdateFollowAI()':
PetSystem.cpp:246: warning: unused variable 'bDoMoveAlone'
PetSystem.cpp: In member function 'CPetActor* CPetSystem::Summon(DWORD, CItem*, const char*, bool, DWORD)':
PetSystem.cpp:552: warning: unused variable 'petVID'
g++: Internal error: Killed: 9 (program cc1plus)
Please submit a full bug report.
See <URL:http://gcc.gnu.org/bugs.html> for instructions.
g++: Internal error: Killed: 9 (program cc1plus)
Please submit a full bug report.
See <URL:http://gcc.gnu.org/bugs.html> for instructions.
g++: Internal error: Killed: 9 (program cc1plus)
Please submit a full bug report.
See <URL:http://gcc.gnu.org/bugs.html> for instructions.
g++: Internal error: Killed: 9 (program cc1plus)
Please submit a full bug report.
See <URL:http://gcc.gnu.org/bugs.html> for instructions.
gmake: *** [OBJDIR/PetSystem.o] Error 1
gmake: *** Waiting for unfinished jobs....
gmake: *** [OBJDIR/char_state.o] Error 1
gmake: *** [OBJDIR/char_battle.o] Error 1
gmake: *** [OBJDIR/char_affect.o] Error 1
{standard input}: Assembler messages:
{standard input}:10728: Warning: end of file not at end of a line; newline inserted
{standard input}: Assembler messages:
{standard input}:11630: Warning: end of file not at end of a line; newline inserted
{standard input}:12774: Error: unknown pseudo-op: `.ul'
char_item.cpp: In member function 'void CHARACTER::BuffOnAttr_ValueChange(BYTE, BYTE, BYTE)':
char_item.cpp:6337: warning: 'pBuff' may be used uninitialized in this function
g++: g++: Internal error: Killed: 9 (program cc1plus)
Please submit a full bug report.
See <URL:http://gcc.gnu.org/bugs.html> for instructions.
Internal error: Killed: 9 (program cc1plus)
Please submit a full bug report.
See <URL:http://gcc.gnu.org/bugs.html> for instructions.
gmake: *** [OBJDIR/arena.o] Error 1
gmake: *** [OBJDIR/OXEvent.o] Error 1
root@metin68:/usr/src/gazer/Srcs/Server/game/src # cd [dep] Error 127
cd: Too many arguments.
root@metin68:/usr/src/gazer/Srcs/Server/game/src #
root@metin68:/usr/src/gazer/Srcs/Server/game/src # cd /
root@metin68:/ #
root@metin68:/ # PetSystem.cpp: In member function 'virtual bool CPetActor::_UpdateFollowAI()':
PetSystem.cpp:: Too many arguments.
root@metin68:/ # PetSystem.cpp:246: warning: unused variable 'bDoMoveAlone'
PetSystem.cpp:246:: Too many arguments.
root@metin68:/ # PetSystem.cpp: In member function 'CPetActor* CPetSystem::Summon(DWORD, CItem*, const char*, bool, DWORD)':
PetSystem.cpp:: Too many arguments.
root@metin68:/ # PetSystem.cpp:552: warning: unused variable 'petVID'
PetSystem.cpp:552:: Too many arguments.
root@metin68:/ # g++: Internal error: Killed: 9 (program cc1plus)
Badly placed ()'s.
root@metin68:/ # Please submit a full bug report.
Please: Command not found.
root@metin68:/ # See <URL:http://gcc.gnu.org/bugs.html> for instructions.
URL:http://gcc.gnu.org/bugs.html: No such file or directory.
root@metin68:/ # g++: Internal error: Killed: 9 (program cc1plus)
Badly placed ()'s.
root@metin68:/ # Please submit a full bug report.
Please: Command not found.
root@metin68:/ # See <URL:http://gcc.gnu.org/bugs.html> for instructions.
URL:http://gcc.gnu.org/bugs.html: No such file or directory.
root@metin68:/ # g++: Internal error: Killed: 9 (program cc1plus)
Badly placed ()'s.
root@metin68:/ # Please submit a full bug report.
Please: Command not found.
root@metin68:/ # See <URL:http://gcc.gnu.org/bugs.html> for instructions.
URL:http://gcc.gnu.org/bugs.html: No such file or directory.
root@metin68:/ # g++: Internal error: Killed: 9 (program cc1plus)
Badly placed ()'s.
root@metin68:/ # Please submit a full bug report.
Please: Command not found.
root@metin68:/ # See <URL:http://gcc.gnu.org/bugs.html> for instructions.
URL:http://gcc.gnu.org/bugs.html: No such file or directory.
root@metin68:/ # gmake: *** [OBJDIR/PetSystem.o] Error 1
gmake:: Too many arguments.
root@metin68:/ # gmake: *** Waiting for unfinished jobs....
gmake:: Too many arguments.
root@metin68:/ # gmake: *** [OBJDIR/char_state.o] Error 1
gmake:: Too many arguments.
root@metin68:/ # gmake: *** [OBJDIR/char_battle.o] Error 1
gmake:: Too many arguments.
root@metin68:/ # gmake: *** [OBJDIR/char_affect.o] Error 1
gmake:: Too many arguments.
root@metin68:/ # {standard input}: Assembler messages:
Missing }.
root@metin68:/ # {standard input}:10728: Warning: end of file not at end of a line; newline inserted
Missing }.
newline: Command not found.
root@metin68:/ # {standard input}: Assembler messages:
Missing }.
root@metin68:/ # {standard input}:11630: Warning: end of file not at end of a line; newline inserted
Missing }.
newline: Command not found.
root@metin68:/ # {standard input}:12774: Error: unknown pseudo-op: `.ul'
Unmatched `.
root@metin68:/ # char_item.cpp: In member function 'void CHARACTER::BuffOnAttr_ValueChange(BYTE, BYTE, BYTE)':
char_item.cpp:: Too many arguments.
root@metin68:/ # char_item.cpp:6337: warning: 'pBuff' may be used uninitialized in this function
char_item.cpp:6337:: Too many arguments.
root@metin68:/ # g++: g++: Internal error: Killed: 9 (program cc1plus)
Badly placed ()'s.
root@metin68:/ # Please submit a full bug report.
Please: Command not found.
root@metin68:/ # See <URL:http://gcc.gnu.org/bugs.html> for instructions.
URL:http://gcc.gnu.org/bugs.html: No such file or directory.
root@metin68:/ # Internal error: Killed: 9 (program cc1plus)
Badly placed ()'s.
root@metin68:/ # Please submit a full bug report.
Please: Command not found.
root@metin68:/ # See <URL:http://gcc.gnu.org/bugs.html> for instructions.
URL:http://gcc.gnu.org/bugs.html: No such file or directory.
root@metin68:/ # gmake: *** [OBJDIR/arena.o] Error 1
gmake:: Too many arguments.
root@metin68:/ # gmake: *** [OBJDIR/OXEvent.o] Error 1
gmake:: Too many arguments.
root@metin68:/ #
Are ceva ca mi-a dat erorile astea ?
Avatar utilizator
[Tupeu]
Membru de Elita

Membru de Elita
Mesaje: 4101
Membru din: 28 Oct 2015, 16:16
Aprecieri: 35  
Mulţumiri: 2304  
 Contact:
Medalii

Unde încerci sa compilezi?

[ Mesaj scris via Android ] Imagine
Închis
Răspunsuri
10
Vizualizări
802
Răspunsuri
12
Vizualizări
1036
Răspunsuri
5
Vizualizări
477

Înapoi la “Arhivă Probleme şi Întrebări”

  • Informaţie
  • Cine este conectat

    Utilizatori ce ce navighează pe acest forum: Niciun utilizator înregistrat și 75 vizitatori