char_item.cpp: In member function 'bool CHARACTER::CleanAcceAttr(CItem*, CItem*)':
char_item.cpp
error: 'COSTUME_ACCE' was not declared in this scope
cmd_general.cpp: In function 'void do_costume(CHARACTER*, const char*, int, int)':
cmd_general.cpp
error: 'WEAR_COSTUME_ACCE' was not declared in this scope
gmake: *** [OBJDIR/cmd_general.o] Error 1
gmake: *** Waiting for unfinished jobs....
gmake: *** [OBJDIR/char_item.o] Error 1
gmake: *** [OBJDIR/char.o] Error 1
acce.cpp: In function 'void FN_remove_material(CItem**, DWORD, int, int)':
acce.cpp:87: warning: unused variable 'count'
acce.cpp: In function 'void Acce_clean_item(CHARACTER*)':
acce.cpp:247: error: 'COSTUME_ACCE' was not declared in this scope
acce.cpp: In function 'void Acce_add_item(CHARACTER*, int, int)':
acce.cpp:799: error: 'COSTUME_ACCE' was not declared in this scope
acce.cpp: In function 'void Acce_delete_item(CHARACTER*, int)':
acce.cpp:846: error: 'COSTUME_ACCE' was not declared in this scope
acce.cpp: In function 'bool Acce_InformationInitialize()':
acce.cpp:943: warning: comparison between signed and unsigned integer expressions
gmake: *** [OBJDIR/acce.o] Error 1
char_item.cpp
cmd_general.cpp: In function 'void do_costume(CHARACTER*, const char*, int, int)':
cmd_general.cpp
gmake: *** [OBJDIR/cmd_general.o] Error 1
gmake: *** Waiting for unfinished jobs....
gmake: *** [OBJDIR/char_item.o] Error 1
gmake: *** [OBJDIR/char.o] Error 1
acce.cpp: In function 'void FN_remove_material(CItem**, DWORD, int, int)':
acce.cpp:87: warning: unused variable 'count'
acce.cpp: In function 'void Acce_clean_item(CHARACTER*)':
acce.cpp:247: error: 'COSTUME_ACCE' was not declared in this scope
acce.cpp: In function 'void Acce_add_item(CHARACTER*, int, int)':
acce.cpp:799: error: 'COSTUME_ACCE' was not declared in this scope
acce.cpp: In function 'void Acce_delete_item(CHARACTER*, int)':
acce.cpp:846: error: 'COSTUME_ACCE' was not declared in this scope
acce.cpp: In function 'bool Acce_InformationInitialize()':
acce.cpp:943: warning: comparison between signed and unsigned integer expressions
gmake: *** [OBJDIR/acce.o] Error 1





de