Includurile pot sa le iau, da' unde le bag?
Folosesc Visual Studio 2013, am incercat cu 2008 si da o eroare la CTimer la class, si una la d3d8.h care e prezenta si aici.
Am incercat cu DirectX SDK de pe microsoft, da' nu merge nici asa!
Uitati output-ul de la build!
ABBC3_SPOILER_SHOW
1>------ Build started: Project: EffectLib, Configuration: Release Win32 ------
2>------ Build started: Project: EterPack, Configuration: Release Win32 ------
3>------ Build started: Project: PRTerrainLib, Configuration: Release Win32 ------
4>------ Build started: Project: SpeedTreeLib, Configuration: Release Win32 ------
2> EterPack.cpp
4> StdAfx.cpp
1> StdAfx.cpp
3> StdAfx.cpp
4>c:\users\marian\desktop\client\client\speedtreelib\SpeedTreeForest.h(35): fatal error C1083: Cannot open include file: 'SpeedTreeRT.h': No such file or directory
3>c:\users\marian\desktop\client\client\prterrainlib\../EterLib/StdAfx.h(23): fatal error C1083: Cannot open include file: 'd3d8.h': No such file or directory
5>------ Build started: Project: SphereLib, Configuration: Release Win32 ------
6>------ Build started: Project: eterBase, Configuration: Release Win32 ------
5> StdAfx.cpp
5>c:\users\marian\desktop\client\client\spherelib\stdafx.h(7): fatal error C1083: Cannot open include file: 'd3d8.h': No such file or directory
7>------ Build started: Project: eterGrnLib, Configuration: Release Win32 ------
7> StdAfx.cpp
7>c:\users\marian\desktop\client\client\etergrnlib\stdafx.h(6): fatal error C1083: Cannot open include file: 'granny.h': No such file or directory
1>c:\users\marian\desktop\client\client\effectlib\../eterLib/StdAfx.h(23): fatal error C1083: Cannot open include file: 'd3d8.h': No such file or directory
8>------ Build started: Project: eterImageLib, Configuration: Release Win32 ------
8> DXTCImage.cpp
9>------ Build started: Project: eterPythonLib, Configuration: Release Win32 ------
9> StdAfx.cpp
9>c:\users\marian\desktop\client\client\eterpythonlib\../EterLib/StdAfx.h(23): fatal error C1083: Cannot open include file: 'd3d8.h': No such file or directory
10>------ Build started: Project: eterlib, Configuration: Release Win32 ------
8>c:\users\marian\desktop\client\client\eterimagelib\StdAfx.h(33): warning C4996: '_vsnprintf': This function or variable may be unsafe. Consider using _vsnprintf_s instead. To disable deprecation, use _CRT_SECURE_NO_WARNINGS. See online help for details.
8> E:\Visual Studio\VC\include\stdio.h(346) : see declaration of '_vsnprintf'
10> StdAfx.cpp
8>c:\users\marian\desktop\client\client\eterbase\lzo.h(5): fatal error C1083: Cannot open include file: 'lzo-2.03/lzo1x.h': No such file or directory
8> TGAImage.cpp
10>c:\users\marian\desktop\client\client\eterlib\stdafx.h(24): fatal error C1083: Cannot open include file: 'd3dx8.h': No such file or directory
6> cipher.cpp
2>c:\users\marian\desktop\client\client\eterbase\filename.h(236): warning C4996: 'strcpy': This function or variable may be unsafe. Consider using strcpy_s instead. To disable deprecation, use _CRT_SECURE_NO_WARNINGS. See online help for details.
2> E:\Visual Studio\VC\include\string.h(112) : see declaration of 'strcpy'
2>c:\users\marian\desktop\client\client\eterpack\EterPack.h(5): fatal error C1083: Cannot open include file: 'boost/unordered_map.hpp': No such file or directory
2> EterPackCursor.cpp
6>c:\users\marian\desktop\client\client\eterbase\cipher.h(8): fatal error C1083: Cannot open include file: 'cryptopp/cryptlib.h': No such file or directory
6> MappedFile.cpp
2>c:\users\marian\desktop\client\client\eterbase\filename.h(236): warning C4996: 'strcpy': This function or variable may be unsafe. Consider using strcpy_s instead. To disable deprecation, use _CRT_SECURE_NO_WARNINGS. See online help for details.
2> E:\Visual Studio\VC\include\string.h(112) : see declaration of 'strcpy'
2>c:\users\marian\desktop\client\client\eterpack\EterPack.h(5): fatal error C1083: Cannot open include file: 'boost/unordered_map.hpp': No such file or directory
2> EterPackManager.cpp
2>c:\users\marian\desktop\client\client\eterbase\filename.h(236): warning C4996: 'strcpy': This function or variable may be unsafe. Consider using strcpy_s instead. To disable deprecation, use _CRT_SECURE_NO_WARNINGS. See online help for details.
2> E:\Visual Studio\VC\include\string.h(112) : see declaration of 'strcpy'
2>c:\users\marian\desktop\client\client\eterpack\EterPackManager.h(4): fatal error C1083: Cannot open include file: 'boost/unordered_map.hpp': No such file or directory
2> EterPackPolicy_CSHybridCrypt.cpp
6>c:\users\marian\desktop\client\client\eterbase\lzo.h(5): fatal error C1083: Cannot open include file: 'lzo-2.03/lzo1x.h': No such file or directory
6> Generating Code...
11>------ Build started: Project: gamelib, Configuration: Release Win32 ------
11> StdAfx.cpp
8>c:\users\marian\desktop\client\client\eterimagelib\StdAfx.h(33): warning C4996: '_vsnprintf': This function or variable may be unsafe. Consider using _vsnprintf_s instead. To disable deprecation, use _CRT_SECURE_NO_WARNINGS. See online help for details.
8> E:\Visual Studio\VC\include\stdio.h(346) : see declaration of '_vsnprintf'
8>c:\users\marian\desktop\client\client\eterbase\lzo.h(5): fatal error C1083: Cannot open include file: 'lzo-2.03/lzo1x.h': No such file or directory
8> Generating Code...
12>------ Build started: Project: mileslib, Configuration: Release Win32 ------
2>c:\users\marian\desktop\client\client\eterbase\filename.h(236): warning C4996: 'strcpy': This function or variable may be unsafe. Consider using strcpy_s instead. To disable deprecation, use _CRT_SECURE_NO_WARNINGS. See online help for details.
2> E:\Visual Studio\VC\include\string.h(112) : see declaration of 'strcpy'
2>c:\users\marian\desktop\client\client\eterpack\EterPackPolicy_CSHybridCrypt.h(4): fatal error C1083: Cannot open include file: 'boost/unordered_map.hpp': No such file or directory
2> Generating Code...
13>------ Build started: Project: scriptLib, Configuration: Release Win32 ------
12> Stdafx.cpp
12>c:\users\marian\desktop\client\client\mileslib\stdafx.h(12): fatal error C1083: Cannot open include file: 'mss.h': No such file or directory
13> StdAfx.cpp
13>c:\users\marian\desktop\client\client\scriptlib\../eterLib/StdAfx.h(23): fatal error C1083: Cannot open include file: 'd3d8.h': No such file or directory
11>c:\users\marian\desktop\client\client\gamelib\../eterLib/StdAfx.h(23): fatal error C1083: Cannot open include file: 'd3d8.h': No such file or directory
14>------ Build started: Project: UserInterface, Configuration: Release Win32 ------
14> StdAfx.cpp
14>c:\users\marian\desktop\client\client\userinterface\../eterLib/StdAfx.h(23): fatal error C1083: Cannot open include file: 'd3d8.h': No such file or directory
========== Build: 0 succeeded, 14 failed, 2 up-to-date, 0 skipped ==========
2>------ Build started: Project: EterPack, Configuration: Release Win32 ------
3>------ Build started: Project: PRTerrainLib, Configuration: Release Win32 ------
4>------ Build started: Project: SpeedTreeLib, Configuration: Release Win32 ------
2> EterPack.cpp
4> StdAfx.cpp
1> StdAfx.cpp
3> StdAfx.cpp
4>c:\users\marian\desktop\client\client\speedtreelib\SpeedTreeForest.h(35): fatal error C1083: Cannot open include file: 'SpeedTreeRT.h': No such file or directory
3>c:\users\marian\desktop\client\client\prterrainlib\../EterLib/StdAfx.h(23): fatal error C1083: Cannot open include file: 'd3d8.h': No such file or directory
5>------ Build started: Project: SphereLib, Configuration: Release Win32 ------
6>------ Build started: Project: eterBase, Configuration: Release Win32 ------
5> StdAfx.cpp
5>c:\users\marian\desktop\client\client\spherelib\stdafx.h(7): fatal error C1083: Cannot open include file: 'd3d8.h': No such file or directory
7>------ Build started: Project: eterGrnLib, Configuration: Release Win32 ------
7> StdAfx.cpp
7>c:\users\marian\desktop\client\client\etergrnlib\stdafx.h(6): fatal error C1083: Cannot open include file: 'granny.h': No such file or directory
1>c:\users\marian\desktop\client\client\effectlib\../eterLib/StdAfx.h(23): fatal error C1083: Cannot open include file: 'd3d8.h': No such file or directory
8>------ Build started: Project: eterImageLib, Configuration: Release Win32 ------
8> DXTCImage.cpp
9>------ Build started: Project: eterPythonLib, Configuration: Release Win32 ------
9> StdAfx.cpp
9>c:\users\marian\desktop\client\client\eterpythonlib\../EterLib/StdAfx.h(23): fatal error C1083: Cannot open include file: 'd3d8.h': No such file or directory
10>------ Build started: Project: eterlib, Configuration: Release Win32 ------
8>c:\users\marian\desktop\client\client\eterimagelib\StdAfx.h(33): warning C4996: '_vsnprintf': This function or variable may be unsafe. Consider using _vsnprintf_s instead. To disable deprecation, use _CRT_SECURE_NO_WARNINGS. See online help for details.
8> E:\Visual Studio\VC\include\stdio.h(346) : see declaration of '_vsnprintf'
10> StdAfx.cpp
8>c:\users\marian\desktop\client\client\eterbase\lzo.h(5): fatal error C1083: Cannot open include file: 'lzo-2.03/lzo1x.h': No such file or directory
8> TGAImage.cpp
10>c:\users\marian\desktop\client\client\eterlib\stdafx.h(24): fatal error C1083: Cannot open include file: 'd3dx8.h': No such file or directory
6> cipher.cpp
2>c:\users\marian\desktop\client\client\eterbase\filename.h(236): warning C4996: 'strcpy': This function or variable may be unsafe. Consider using strcpy_s instead. To disable deprecation, use _CRT_SECURE_NO_WARNINGS. See online help for details.
2> E:\Visual Studio\VC\include\string.h(112) : see declaration of 'strcpy'
2>c:\users\marian\desktop\client\client\eterpack\EterPack.h(5): fatal error C1083: Cannot open include file: 'boost/unordered_map.hpp': No such file or directory
2> EterPackCursor.cpp
6>c:\users\marian\desktop\client\client\eterbase\cipher.h(8): fatal error C1083: Cannot open include file: 'cryptopp/cryptlib.h': No such file or directory
6> MappedFile.cpp
2>c:\users\marian\desktop\client\client\eterbase\filename.h(236): warning C4996: 'strcpy': This function or variable may be unsafe. Consider using strcpy_s instead. To disable deprecation, use _CRT_SECURE_NO_WARNINGS. See online help for details.
2> E:\Visual Studio\VC\include\string.h(112) : see declaration of 'strcpy'
2>c:\users\marian\desktop\client\client\eterpack\EterPack.h(5): fatal error C1083: Cannot open include file: 'boost/unordered_map.hpp': No such file or directory
2> EterPackManager.cpp
2>c:\users\marian\desktop\client\client\eterbase\filename.h(236): warning C4996: 'strcpy': This function or variable may be unsafe. Consider using strcpy_s instead. To disable deprecation, use _CRT_SECURE_NO_WARNINGS. See online help for details.
2> E:\Visual Studio\VC\include\string.h(112) : see declaration of 'strcpy'
2>c:\users\marian\desktop\client\client\eterpack\EterPackManager.h(4): fatal error C1083: Cannot open include file: 'boost/unordered_map.hpp': No such file or directory
2> EterPackPolicy_CSHybridCrypt.cpp
6>c:\users\marian\desktop\client\client\eterbase\lzo.h(5): fatal error C1083: Cannot open include file: 'lzo-2.03/lzo1x.h': No such file or directory
6> Generating Code...
11>------ Build started: Project: gamelib, Configuration: Release Win32 ------
11> StdAfx.cpp
8>c:\users\marian\desktop\client\client\eterimagelib\StdAfx.h(33): warning C4996: '_vsnprintf': This function or variable may be unsafe. Consider using _vsnprintf_s instead. To disable deprecation, use _CRT_SECURE_NO_WARNINGS. See online help for details.
8> E:\Visual Studio\VC\include\stdio.h(346) : see declaration of '_vsnprintf'
8>c:\users\marian\desktop\client\client\eterbase\lzo.h(5): fatal error C1083: Cannot open include file: 'lzo-2.03/lzo1x.h': No such file or directory
8> Generating Code...
12>------ Build started: Project: mileslib, Configuration: Release Win32 ------
2>c:\users\marian\desktop\client\client\eterbase\filename.h(236): warning C4996: 'strcpy': This function or variable may be unsafe. Consider using strcpy_s instead. To disable deprecation, use _CRT_SECURE_NO_WARNINGS. See online help for details.
2> E:\Visual Studio\VC\include\string.h(112) : see declaration of 'strcpy'
2>c:\users\marian\desktop\client\client\eterpack\EterPackPolicy_CSHybridCrypt.h(4): fatal error C1083: Cannot open include file: 'boost/unordered_map.hpp': No such file or directory
2> Generating Code...
13>------ Build started: Project: scriptLib, Configuration: Release Win32 ------
12> Stdafx.cpp
12>c:\users\marian\desktop\client\client\mileslib\stdafx.h(12): fatal error C1083: Cannot open include file: 'mss.h': No such file or directory
13> StdAfx.cpp
13>c:\users\marian\desktop\client\client\scriptlib\../eterLib/StdAfx.h(23): fatal error C1083: Cannot open include file: 'd3d8.h': No such file or directory
11>c:\users\marian\desktop\client\client\gamelib\../eterLib/StdAfx.h(23): fatal error C1083: Cannot open include file: 'd3d8.h': No such file or directory
14>------ Build started: Project: UserInterface, Configuration: Release Win32 ------
14> StdAfx.cpp
14>c:\users\marian\desktop\client\client\userinterface\../eterLib/StdAfx.h(23): fatal error C1083: Cannot open include file: 'd3d8.h': No such file or directory
========== Build: 0 succeeded, 14 failed, 2 up-to-date, 0 skipped ==========
O zi placuta!

