-gmake clean
-gmake -j20
Am incercat si cu gmake dep si dupa gmake -j20 .
si imi da erroarea asta , de ce ?
char.cpp
error: could not convert '((CHARACTER*)this)->CHARACTER::m_pkMiningEvent' to 'bool'
char.cpp: In member function 'void CHARACTER::mining(CHARACTER*)':
char.cpp
error: could not convert '((CHARACTER*)this)->CHARACTER::m_pkMiningEvent' to 'bool'
char.cpp: In member function 'void CHARACTER::fishing()':
char.cpp:4006: error: could not convert '((CHARACTER*)this)->CHARACTER::m_pkFishingEvent' to 'bool'
char.cpp: In member function 'void CHARACTER::fishing_take()':
char.cpp:4056: error: could not convert '((CHARACTER*)this)->CHARACTER::m_pkFishingEvent' to 'bool'
char.cpp: In member function 'void CHARACTER::StartOfflineShopUpdateEvent()':
char.cpp:4463: error: could not convert '((CHARACTER*)this)->CHARACTER::m_pkOfflineShopUpdateEvent' to 'bool'
char.cpp: In member function 'bool CHARACTER::RequestToParty(CHARACTER*)':
char.cpp:4702: error: could not convert '((CHARACTER*)this)->CHARACTER::m_pkPartyRequestEvent' to 'bool'
char.cpp: In member function 'void CHARACTER::DenyToParty(CHARACTER*)':
char.cpp:4774: error: no match for 'operator!' in '!member->CHARACTER::m_pkPartyRequestEvent'
char.cpp:4774: note: candidates are: operator!(bool) <built-in>
char.cpp: In member function 'void CHARACTER::AcceptToParty(CHARACTER*)':
char.cpp:4800: error: no match for 'operator!' in '!member->CHARACTER::m_pkPartyRequestEvent'
char.cpp:4800: note: candidates are: operator!(bool) <built-in>
char.cpp: In member function 'void CHARACTER::SetTarget(CHARACTER*)':
char.cpp:5481: warning: suggest parentheses around && within ||
char.cpp: In member function 'bool CHARACTER::CanSummon(int)':
char.cpp:6666: warning: suggest parentheses around && within ||
char.cpp: In member function 'void CHARACTER::StartWarpNPCEvent()':
char.cpp:6835: error: could not convert '((CHARACTER*)this)->CHARACTER::m_pkWarpNPCEvent' to 'bool'
char.cpp: In member function 'void CHARACTER::StartCheckSpeedHackEvent()':
char.cpp:7407: error: could not convert '((CHARACTER*)this)->CHARACTER::m_pkCheckSpeedHackEvent' to 'bool'
char.cpp: In member function 'void CHARACTER::StartDestroyWhenIdleEvent()':
char.cpp:7478: error: could not convert '((CHARACTER*)this)->CHARACTER::m_pkDestroyWhenIdleEvent' to 'bool'
/usr/local/include/boost/intrusive_ptr.hpp: In member function 'T* boost::intrusive_ptr<T>::operator->() const [with T = event]':
char.cpp
instantiated from here
/usr/local/include/boost/intrusive_ptr.hpp:166: error: 'BOOST_ASSERT' was not declared in this scope
Makefile:131: recipe for target 'OBJDIR/char_battle.o' failed
gmake: *** [OBJDIR/char_battle.o] Error 1
Makefile:131: recipe for target 'OBJDIR/char.o' failed
gmake: *** [OBJDIR/char.o] Error 1
char.cpp: In member function 'void CHARACTER::mining(CHARACTER*)':
char.cpp
char.cpp: In member function 'void CHARACTER::fishing()':
char.cpp:4006: error: could not convert '((CHARACTER*)this)->CHARACTER::m_pkFishingEvent' to 'bool'
char.cpp: In member function 'void CHARACTER::fishing_take()':
char.cpp:4056: error: could not convert '((CHARACTER*)this)->CHARACTER::m_pkFishingEvent' to 'bool'
char.cpp: In member function 'void CHARACTER::StartOfflineShopUpdateEvent()':
char.cpp:4463: error: could not convert '((CHARACTER*)this)->CHARACTER::m_pkOfflineShopUpdateEvent' to 'bool'
char.cpp: In member function 'bool CHARACTER::RequestToParty(CHARACTER*)':
char.cpp:4702: error: could not convert '((CHARACTER*)this)->CHARACTER::m_pkPartyRequestEvent' to 'bool'
char.cpp: In member function 'void CHARACTER::DenyToParty(CHARACTER*)':
char.cpp:4774: error: no match for 'operator!' in '!member->CHARACTER::m_pkPartyRequestEvent'
char.cpp:4774: note: candidates are: operator!(bool) <built-in>
char.cpp: In member function 'void CHARACTER::AcceptToParty(CHARACTER*)':
char.cpp:4800: error: no match for 'operator!' in '!member->CHARACTER::m_pkPartyRequestEvent'
char.cpp:4800: note: candidates are: operator!(bool) <built-in>
char.cpp: In member function 'void CHARACTER::SetTarget(CHARACTER*)':
char.cpp:5481: warning: suggest parentheses around && within ||
char.cpp: In member function 'bool CHARACTER::CanSummon(int)':
char.cpp:6666: warning: suggest parentheses around && within ||
char.cpp: In member function 'void CHARACTER::StartWarpNPCEvent()':
char.cpp:6835: error: could not convert '((CHARACTER*)this)->CHARACTER::m_pkWarpNPCEvent' to 'bool'
char.cpp: In member function 'void CHARACTER::StartCheckSpeedHackEvent()':
char.cpp:7407: error: could not convert '((CHARACTER*)this)->CHARACTER::m_pkCheckSpeedHackEvent' to 'bool'
char.cpp: In member function 'void CHARACTER::StartDestroyWhenIdleEvent()':
char.cpp:7478: error: could not convert '((CHARACTER*)this)->CHARACTER::m_pkDestroyWhenIdleEvent' to 'bool'
/usr/local/include/boost/intrusive_ptr.hpp: In member function 'T* boost::intrusive_ptr<T>::operator->() const [with T = event]':
char.cpp
/usr/local/include/boost/intrusive_ptr.hpp:166: error: 'BOOST_ASSERT' was not declared in this scope
Makefile:131: recipe for target 'OBJDIR/char_battle.o' failed
gmake: *** [OBJDIR/char_battle.o] Error 1
Makefile:131: recipe for target 'OBJDIR/char.o' failed
gmake: *** [OBJDIR/char.o] Error 1



