Eroare compliare sura binary

Totalitatea subiectelor care nu respectă regulamentul impus in sectiunea "Probleme şi Întrebări" vor fi stocate aici.
Închis
Avatar utilizator
Izabella
Miss Just4Metin

Miss Just4Metin
Mesaje: 375
Membru din: 09 Iul 2014, 08:21
Server: www.metin2brave.com
Regat: Shinsoo
Aprecieri: 18  
Mulţumiri: 2  
 Contact:
Medalii

Salutare j4m , am facut tot ce trebuie pentru compliare, dar cand am vrut sa compliez sursa clientului primesc erorile acestea.. Care este problema?

Cod: Selectaţi tot

1>------ Build started: Project: EterLocale, Configuration: Release Win32 ------
2>------ Build started: Project: CWebBrowser, Configuration: Release Win32 ------
3>------ Build started: Project: EffectLib, Configuration: Release Win32 ------
4>------ Build started: Project: EterPack, Configuration: Release Win32 ------
1>  StdAfx.cpp
1>C:\Program Files (x86)\Windows Kits\8.1\Include\um\winnt.h(31): fatal error C1083: Cannot open include file: 'ctype.h': No such file or directory
2>  CWebBrowser.c
3>  StdAfx.cpp
2>C:\Program Files (x86)\Windows Kits\8.1\Include\um\winnt.h(31): fatal error C1083: Cannot open include file: 'ctype.h': No such file or directory
3>C:\Program Files (x86)\Windows Kits\8.1\Include\um\winnt.h(31): fatal error C1083: Cannot open include file: 'ctype.h': No such file or directory
5>------ Build started: Project: PRTerrainLib, Configuration: Release Win32 ------
4>  EterPack.cpp
4>C:\Program Files (x86)\Windows Kits\8.1\Include\um\winnt.h(31): fatal error C1083: Cannot open include file: 'ctype.h': No such file or directory
4>  Generating Code...
4>  Compiling...
4>  EterPackCursor.cpp
6>------ Build started: Project: SpeedTreeLib, Configuration: Release Win32 ------
4>C:\Program Files (x86)\Windows Kits\8.1\Include\um\winnt.h(31): fatal error C1083: Cannot open include file: 'ctype.h': No such file or directory
4>  Generating Code...
4>  Compiling...
4>  EterPackManager.cpp
4>C:\Program Files (x86)\Windows Kits\8.1\Include\um\winnt.h(31): fatal error C1083: Cannot open include file: 'ctype.h': No such file or directory
4>  Generating Code...
4>  Compiling...
4>  EterPackPolicy_CSHybridCrypt.cpp
6>  StdAfx.cpp
7>------ Build started: Project: SphereLib, Configuration: Release Win32 ------
5>  StdAfx.cpp
4>C:\Program Files (x86)\Windows Kits\8.1\Include\um\winnt.h(31): fatal error C1083: Cannot open include file: 'ctype.h': No such file or directory
5>d:\gamez\resurselebrave\sursa client binary\sursa client noua\prterrainlib\../EterLib/StdAfx.h(23): fatal error C1083: Cannot open include file: 'd3d8.h': No such file or directory
8>------ Build started: Project: eterBase, Configuration: Release Win32 ------
6>d:\gamez\resurselebrave\sursa client binary\sursa client noua\speedtreelib\stdafx.h(5): fatal error C1083: Cannot open include file: 'assert.h': No such file or directory
4>  Generating Code...
4>  Compiling...
4>  StdAfx.cpp
4>C:\Program Files (x86)\Windows Kits\8.1\Include\um\winnt.h(31): fatal error C1083: Cannot open include file: 'ctype.h': No such file or directory
9>------ Build started: Project: eterGrnLib, Configuration: Release Win32 ------
4>  Generating Code...
7>  StdAfx.cpp
7>d:\gamez\resurselebrave\sursa client binary\sursa client noua\spherelib\stdafx.h(7): fatal error C1083: Cannot open include file: 'd3d8.h': No such file or directory
9>  StdAfx.cpp
10>------ Build started: Project: eterImageLib, Configuration: Release Win32 ------
9>d:\gamez\resurselebrave\sursa client binary\sursa client noua\etergrnlib\stdafx.h(6): fatal error C1083: Cannot open include file: 'granny.h': No such file or directory
11>------ Build started: Project: eterPythonLib, Configuration: Release Win32 ------
10>  StdAfx.cpp
10>C:\Program Files (x86)\Windows Kits\8.1\Include\um\winnt.h(31): fatal error C1083: Cannot open include file: 'ctype.h': No such file or directory
11>  StdAfx.cpp
12>------ Build started: Project: eterlib, Configuration: Release Win32 ------
11>d:\gamez\resurselebrave\sursa client binary\sursa client noua\eterpythonlib\../EterLib/StdAfx.h(23): fatal error C1083: Cannot open include file: 'd3d8.h': No such file or directory
13>------ Build started: Project: gamelib, Configuration: Release Win32 ------
12>  StdAfx.cpp
12>d:\gamez\resurselebrave\sursa client binary\sursa client noua\eterlib\stdafx.h(23): fatal error C1083: Cannot open include file: 'd3d8.h': No such file or directory
14>------ Build started: Project: mileslib, Configuration: Release Win32 ------
13>  StdAfx.cpp
13>C:\Program Files (x86)\Windows Kits\8.1\Include\um\winnt.h(31): fatal error C1083: Cannot open include file: 'ctype.h': No such file or directory
14>  Stdafx.cpp
15>------ Build started: Project: scriptLib, Configuration: Release Win32 ------
14>d:\gamez\resurselebrave\sursa client binary\sursa client noua\mileslib\stdafx.h(12): fatal error C1083: Cannot open include file: 'mss.h': No such file or directory
15>  StdAfx.cpp
15>d:\gamez\resurselebrave\sursa client binary\sursa client noua\scriptlib\../eterLib/StdAfx.h(23): fatal error C1083: Cannot open include file: 'd3d8.h': No such file or directory
8>  cipher.cpp
8>C:\Program Files (x86)\Windows Kits\8.1\Include\um\winnt.h(31): fatal error C1083: Cannot open include file: 'ctype.h': No such file or directory
8>  Generating Code...
8>  Compiling...
8>  CPostIt.cpp
8>C:\Program Files (x86)\Windows Kits\8.1\Include\um\winnt.h(31): fatal error C1083: Cannot open include file: 'ctype.h': No such file or directory
8>  Generating Code...
8>  Compiling...
8>  CRC32.cpp
8>C:\Program Files (x86)\Windows Kits\8.1\Include\um\winnt.h(31): fatal error C1083: Cannot open include file: 'ctype.h': No such file or directory
8>  Generating Code...
8>  Compiling...
8>  Debug.cpp
8>C:\Program Files (x86)\Windows Kits\8.1\Include\um\winnt.h(31): fatal error C1083: Cannot open include file: 'ctype.h': No such file or directory
8>  Generating Code...
8>  Compiling...
8>  error.cpp
8>C:\Program Files (x86)\Windows Kits\8.1\Include\um\winnt.h(31): fatal error C1083: Cannot open include file: 'ctype.h': No such file or directory
8>  Generating Code...
8>  Compiling...
8>  FileBase.cpp
8>C:\Program Files (x86)\Windows Kits\8.1\Include\um\winnt.h(31): fatal error C1083: Cannot open include file: 'ctype.h': No such file or directory
8>  Generating Code...
8>  Compiling...
8>  FileDir.cpp
8>C:\Program Files (x86)\Windows Kits\8.1\Include\um\winnt.h(31): fatal error C1083: Cannot open include file: 'ctype.h': No such file or directory
8>  Generating Code...
8>  Compiling...
8>  FileLoader.cpp
8>C:\Program Files (x86)\Windows Kits\8.1\Include\um\winnt.h(31): fatal error C1083: Cannot open include file: 'ctype.h': No such file or directory
8>  Generating Code...
8>  Compiling...
8>  lzo.cpp
8>C:\Program Files (x86)\Windows Kits\8.1\Include\um\winnt.h(31): fatal error C1083: Cannot open include file: 'ctype.h': No such file or directory
8>  Generating Code...
8>  Compiling...
8>  MappedFile.cpp
8>C:\Program Files (x86)\Windows Kits\8.1\Include\um\winnt.h(31): fatal error C1083: Cannot open include file: 'ctype.h': No such file or directory
8>  Generating Code...
8>  Compiling...
8>  Base.cpp
8>C:\Program Files (x86)\Windows Kits\8.1\Include\um\winnt.h(31): fatal error C1083: Cannot open include file: 'ctype.h': No such file or directory
8>  Generating Code...
8>  Compiling...
8>  Poly.cpp
8>C:\Program Files (x86)\Windows Kits\8.1\Include\um\winnt.h(31): fatal error C1083: Cannot open include file: 'ctype.h': No such file or directory
8>  Generating Code...
8>  Compiling...
8>  Symbol.cpp
8>C:\Program Files (x86)\Windows Kits\8.1\Include\um\winnt.h(31): fatal error C1083: Cannot open include file: 'ctype.h': No such file or directory
8>  Generating Code...
8>  Compiling...
8>  SymTable.cpp
8>C:\Program Files (x86)\Windows Kits\8.1\Include\um\winnt.h(31): fatal error C1083: Cannot open include file: 'ctype.h': No such file or directory
8>  Generating Code...
8>  Compiling...
8>  Random.cpp
8>C:\Program Files (x86)\Windows Kits\8.1\Include\um\winnt.h(31): fatal error C1083: Cannot open include file: 'ctype.h': No such file or directory
8>  Generating Code...
8>  Compiling...
8>  StdAfx.cpp
8>C:\Program Files (x86)\Windows Kits\8.1\Include\um\winnt.h(31): fatal error C1083: Cannot open include file: 'ctype.h': No such file or directory
8>  Generating Code...
8>  Compiling...
8>  Stl.cpp
8>C:\Program Files (x86)\Windows Kits\8.1\Include\um\winnt.h(31): fatal error C1083: Cannot open include file: 'ctype.h': No such file or directory
8>  Generating Code...
8>  Compiling...
8>  tea.cpp
8>C:\Program Files (x86)\Windows Kits\8.1\Include\um\winnt.h(31): fatal error C1083: Cannot open include file: 'ctype.h': No such file or directory
8>  Generating Code...
8>  Compiling...
8>  TempFile.cpp
8>C:\Program Files (x86)\Windows Kits\8.1\Include\um\winnt.h(31): fatal error C1083: Cannot open include file: 'ctype.h': No such file or directory
8>  Generating Code...
8>  Compiling...
8>  Timer.cpp
8>C:\Program Files (x86)\Windows Kits\8.1\Include\um\winnt.h(31): fatal error C1083: Cannot open include file: 'ctype.h': No such file or directory
8>  Generating Code...
8>  Compiling...
8>  Utils.cpp
8>C:\Program Files (x86)\Windows Kits\8.1\Include\um\winnt.h(31): fatal error C1083: Cannot open include file: 'ctype.h': No such file or directory
8>  Generating Code...
16>------ Build started: Project: UserInterface, Configuration: Release Win32 ------
16>  StdAfx.cpp
16>d:\gamez\resurselebrave\sursa client binary\sursa client noua\userinterface\../eterLib/StdAfx.h(23): fatal error C1083: Cannot open include file: 'd3d8.h': No such file or directory
========== Build: 0 succeeded, 16 failed, 0 up-to-date, 0 skipped ==========
Avatar utilizator
[Tupeu]
Membru de Elita

Membru de Elita
Mesaje: 4101
Membru din: 28 Oct 2015, 16:16
Aprecieri: 35  
Mulţumiri: 2304  
 Contact:
Medalii

Ai setat locatia lib si include?
Avatar utilizator
Izabella
Miss Just4Metin

Miss Just4Metin
Mesaje: 375
Membru din: 09 Iul 2014, 08:21
Server: www.metin2brave.com
Regat: Shinsoo
Aprecieri: 18  
Mulţumiri: 2  
 Contact:
Medalii

qTupeu scrie:Ai setat locatia lib si include?
Da, am precizat mai sus ca am pregatit totul pentru compliare ..
Avatar utilizator
[Tupeu]
Membru de Elita

Membru de Elita
Mesaje: 4101
Membru din: 28 Oct 2015, 16:16
Aprecieri: 35  
Mulţumiri: 2304  
 Contact:
Medalii

Ai setat gresit locatia. El iti ia de aici:
C:\Program Files (x86)\Windows Kits\8.1\Include\um\winnt.h(31)
Vezi poate ai setat la unul singur locatia si nu la toate.
Avatar utilizator
F4NTOM4
Nivel 2

Nivel 2
Mesaje: 158
Membru din: 23 Aug 2014, 00:16
Server: BlackMt2Story
Regat: Jinno
Aprecieri: 33  
Mulţumiri: 11  
 Contact:
Medalii

Fa cateva teste:
Dute in UserInterface si in bara de la windows cea care arata locatia scrie ..\..\extern
daca te duce in extern este bine , daca nu te duce aceasta este calea unde trebuie sa fie extern ..\..\ Calea se verifica doar din UserInterface.
Pe deasupra vezi ca in sursa la fiecare folder sa fie setata locatia include pentru c++ , optiunea este diferita de include din vc++.
Rezumat:
Asigurate ca ai calea asta in VC++ Directories (Asta este pentru include si libs): ..\..\extern\
Asigurate ca ai caile astea pentru C/C++(sa nu omiti primul punct pentru ca acela determina folderul actual):
.
../../extern/
Pentru acest mesaj, F4NTOM4 for the post:
mihaisandu531
Imagine
Afișează semnătura
Avatar utilizator
Zerant :3
Nivel 4

Nivel 4
Mesaje: 723
Membru din: 17 Oct 2015, 12:53
Server: Velor2
Regat: Jinno
Aprecieri: 15  
Mulţumiri: 141  
Discord: Copiază ID
Medalii

Subiect vechi >> Arhivat
Închis
Răspunsuri
0
Vizualizări
123
Răspunsuri
1
Vizualizări
137
Răspunsuri
1
Vizualizări
126

Înapoi la “Arhivă Probleme şi Întrebări”

  • Informaţie
  • Cine este conectat

    Utilizatori ce ce navighează pe acest forum: Niciun utilizator înregistrat și 136 vizitatori