Problema compilare sursa serenety v1 fixed

Totalitatea subiectelor care nu respectă regulamentul impus in sectiunea "Probleme şi Întrebări" vor fi stocate aici.
Închis
Avatar utilizator
Fikri
Nivel 2

Nivel 2
Mesaje: 180
Membru din: 05 Iul 2015, 11:38
Aprecieri: 19  
Mulţumiri: 3  
Medalii

Primesc aceasta eroare
1>------ Rebuild All started: Project: EterLocale, Configuration: Release Win32 ------
2>------ Rebuild All started: Project: scriptLib, Configuration: Release Win32 ------
3>------ Rebuild All started: Project: mileslib, Configuration: Release Win32 ------
4>------ Rebuild All started: Project: gamelib, Configuration: Release Win32 ------
2>Build started 7/8/2016 7:29:26 AM.
2>_PrepareForClean:
2> Deleting file ".\Release\scriptLib.lastbuildstate".
1>Build started 7/8/2016 7:29:26 AM.
4>Build started 7/8/2016 7:29:26 AM.
4>Project file contains ToolsVersion="12.0". This toolset may be unknown or missing, in which case you may be able to resolve this by installing the appropriate version of MSBuild, or the build may have been forced to a particular ToolsVersion for policy reasons. Treating the project as if it had ToolsVersion="4.0". For more information, please see http://go.microsoft.com/fwlink/?LinkId=291333.
1>_PrepareForClean:
1> Deleting file ".\Release\EterLocale.lastbuildstate".
2>InitializeBuildStatus:
2> Touching ".\Release\scriptLib.unsuccessfulbuild".
3>Build started 7/8/2016 7:29:26 AM.
2>ClCompile:
2> StdAfx.cpp
3>_PrepareForClean:
3> Deleting file ".\Release\mileslib.lastbuildstate".
2>c:\users\alex\desktop\server\source launcher v1\scriptlib\../eterLib/StdAfx.h(23): fatal error C1083: Cannot open include file: 'd3d8.h': No such file or directory
3>InitializeBuildStatus:
3> Touching ".\Release\mileslib.unsuccessfulbuild".
2>
2>Build FAILED.
2>
2>Time Elapsed 00:00:00.12
4>C:\Program Files (x86)\MSBuild\Microsoft.Cpp\v4.0\Platforms\Win32\Microsoft.Cpp.Win32.Targets(511,5): error MSB8008: Specified platform toolset (v120) is not installed or invalid. Please make sure that a supported PlatformToolset value is selected.
3>ClCompile:
3> Stdafx.cpp
4>
4>Build FAILED.
4>
4>Time Elapsed 00:00:00.11
5>------ Rebuild All started: Project: eterPythonLib, Configuration: Release Win32 ------
3>c:\users\alex\desktop\server\source launcher v1\mileslib\stdafx.h(12): fatal error C1083: Cannot open include file: 'mss.h': No such file or directory
5>Build started 7/8/2016 7:29:26 AM.
5>_PrepareForClean:
5> Deleting file ".\Release\eterPythonLib.lastbuildstate".
5>InitializeBuildStatus:
5> Touching ".\Release\eterPythonLib.unsuccessfulbuild".
1>InitializeBuildStatus:
1> Creating ".\Release\EterLocale.unsuccessfulbuild" because "AlwaysCreate" was specified.
1>ClCompile:
1> StdAfx.cpp
5>ClCompile:
5> StdAfx.cpp
5>c:\users\alex\desktop\server\source launcher v1\eterpythonlib\../EterLib/StdAfx.h(23): fatal error C1083: Cannot open include file: 'd3d8.h': No such file or directory
3>
3>Build FAILED.
3>
3>Time Elapsed 00:00:00.17
5>
5>Build FAILED.
5>
5>Time Elapsed 00:00:00.08
6>------ Rebuild All started: Project: eterImageLib, Configuration: Release Win32 ------
7>------ Rebuild All started: Project: eterGrnLib, Configuration: Release Win32 ------
6>Build started 7/8/2016 7:29:27 AM.
6>_PrepareForClean:
7>Build started 7/8/2016 7:29:27 AM.
7>_PrepareForClean:
7> Deleting file ".\Release\eterGrnLib.lastbuildstate".
6> Deleting file ".\Release\eterImageLib.lastbuildstate".
7>InitializeBuildStatus:
6>InitializeBuildStatus:
6> Touching ".\Release\eterImageLib.unsuccessfulbuild".
7> Touching ".\Release\eterGrnLib.unsuccessfulbuild".
7>ClCompile:
6>ClCompile:
6> StdAfx.cpp
7> StdAfx.cpp
7>c:\users\alex\desktop\server\source launcher v1\etergrnlib\stdafx.h(6): fatal error C1083: Cannot open include file: 'granny.h': No such file or directory
7>
7>Build FAILED.
7>
7>Time Elapsed 00:00:00.09
8>------ Rebuild All started: Project: eterBase, Configuration: Release Win32 ------
8>Build started 7/8/2016 7:29:27 AM.
8>_PrepareForClean:
8> Deleting file ".\Release\eterBase.lastbuildstate".
1> Arabic.cpp
8>InitializeBuildStatus:
8> Touching ".\Release\eterBase.unsuccessfulbuild".
1> Japanese.cpp
9>------ Rebuild All started: Project: EffectLib, Configuration: Release Win32 ------
9>Build started 7/8/2016 7:29:27 AM.
9>_PrepareForClean:
9> Deleting file ".\Release\EffectLib.lastbuildstate".
9>InitializeBuildStatus:
9> Touching ".\Release\EffectLib.unsuccessfulbuild".
9>ClCompile:
9> StdAfx.cpp
1> StringCodec.cpp
1> StringCodec_Vietnamese.cpp
8>ClCompile:
8> Base.cpp
6>c:\users\alex\desktop\server\source launcher v1\eterimagelib\stdafx.h(33): warning C4996: '_vsnprintf': This function or variable may be unsafe. Consider using _vsnprintf_s instead. To disable deprecation, use _CRT_SECURE_NO_WARNINGS. See online help for details.
6> C:\Program Files (x86)\Microsoft Visual Studio 10.0\VC\include\stdio.h(363) : see declaration of '_vsnprintf'
1> Generating Code...
8> Poly.cpp
9>c:\users\alex\desktop\server\source launcher v1\effectlib\../eterLib/StdAfx.h(23): fatal error C1083: Cannot open include file: 'd3d8.h': No such file or directory
1>Lib:
1> EterLocale_VC90.vcxproj -> C:\Users\Alex\Desktop\server\Source Launcher v1\EterLocale\.\Release\EterLocale.lib
1>FinalizeBuildStatus:
1> Deleting file ".\Release\EterLocale.unsuccessfulbuild".
1> Touching ".\Release\EterLocale.lastbuildstate".
1>
1>Build succeeded.
1>
1>Time Elapsed 00:00:01.17
9>
9>Build FAILED.
9>
9>Time Elapsed 00:00:00.63
10>------ Rebuild All started: Project: eterlib, Configuration: Release Win32 ------
10>Build started 7/8/2016 7:29:27 AM.
10>_PrepareForClean:
10> Deleting file ".\Release\eterlib.lastbuildstate".
10>InitializeBuildStatus:
10> Touching ".\Release\eterlib.unsuccessfulbuild".
10>ClCompile:
10> StdAfx.cpp
10>c:\users\alex\desktop\server\source launcher v1\eterlib\stdafx.h(23): fatal error C1083: Cannot open include file: 'd3d8.h': No such file or directory
10>
10>Build FAILED.
10>
10>Time Elapsed 00:00:00.08
11>------ Rebuild All started: Project: SphereLib, Configuration: Release Win32 ------
11>Build started 7/8/2016 7:29:28 AM.
11>_PrepareForClean:
11> Deleting file ".\Release\SphereLib.lastbuildstate".
11>InitializeBuildStatus:
11> Touching ".\Release\SphereLib.unsuccessfulbuild".
11>ClCompile:
11> StdAfx.cpp
11>c:\users\alex\desktop\server\source launcher v1\spherelib\stdafx.h(7): fatal error C1083: Cannot open include file: 'd3d8.h': No such file or directory
11>
11>Build FAILED.
11>
11>Time Elapsed 00:00:00.06
8> Symbol.cpp
12>------ Rebuild All started: Project: SpeedTreeLib, Configuration: Release Win32 ------
12>Build started 7/8/2016 7:29:28 AM.
12>_PrepareForClean:
12> Deleting file ".\Release\SpeedTreeLib.lastbuildstate".
12>InitializeBuildStatus:
12> Touching ".\Release\SpeedTreeLib.unsuccessfulbuild".
12>ClCompile:
12> StdAfx.cpp
12>c:\users\alex\desktop\server\source launcher v1\speedtreelib\SpeedTreeForest.h(35): fatal error C1083: Cannot open include file: 'SpeedTreeRT.h': No such file or directory
12>
12>Build FAILED.
12>
12>Time Elapsed 00:00:00.07
13>------ Rebuild All started: Project: PRTerrainLib, Configuration: Release Win32 ------
13>Build started 7/8/2016 7:29:28 AM.
13>_PrepareForClean:
13> Deleting file ".\Release\PRTerrainLib.lastbuildstate".
13>InitializeBuildStatus:
13> Touching ".\Release\PRTerrainLib.unsuccessfulbuild".
13>ClCompile:
13> StdAfx.cpp
13>c:\users\alex\desktop\server\source launcher v1\prterrainlib\../EterLib/StdAfx.h(23): fatal error C1083: Cannot open include file: 'd3d8.h': No such file or directory
14>------ Rebuild All started: Project: EterPack, Configuration: Release Win32 ------
13>
13>Build FAILED.
13>
13>Time Elapsed 00:00:00.06
14>Build started 7/8/2016 7:29:28 AM.
14>_PrepareForClean:
14> Deleting file ".\Release\EterPack.lastbuildstate".
14>InitializeBuildStatus:
14> Touching ".\Release\EterPack.unsuccessfulbuild".
14>ClCompile:
14> EterPack.cpp
8> SymTable.cpp
15>------ Rebuild All started: Project: CWebBrowser, Configuration: Release Win32 ------
15>Build started 7/8/2016 7:29:28 AM.
15>_PrepareForClean:
15> Deleting file ".\Release\CWebBrowser.lastbuildstate".
15>InitializeBuildStatus:
15> Creating ".\Release\CWebBrowser.unsuccessfulbuild" because "AlwaysCreate" was specified.
15>ClCompile:
15> CWebBrowser.c
14>c:\users\alex\desktop\server\source launcher v1\eterbase\filename.h(236): warning C4996: 'strcpy': This function or variable may be unsafe. Consider using strcpy_s instead. To disable deprecation, use _CRT_SECURE_NO_WARNINGS. See online help for details.
14> C:\Program Files (x86)\Microsoft Visual Studio 10.0\VC\include\string.h(105) : see declaration of 'strcpy'
14>c:\users\alex\desktop\server\source launcher v1\eterpack\EterPack.h(5): fatal error C1083: Cannot open include file: 'boost/unordered_map.hpp': No such file or directory
14> EterPackCursor.cpp
8> cipher.cpp
15>Lib:
15> CWebBrowser_VC90.vcxproj -> C:\Users\Alex\Desktop\server\Source Launcher v1\CWebBrowser\.\Release\CWebBrowser.lib
15>FinalizeBuildStatus:
15> Deleting file ".\Release\CWebBrowser.unsuccessfulbuild".
15> Touching ".\Release\CWebBrowser.lastbuildstate".
15>
15>Build succeeded.
15>
15>Time Elapsed 00:00:00.50
14>c:\users\alex\desktop\server\source launcher v1\eterbase\filename.h(236): warning C4996: 'strcpy': This function or variable may be unsafe. Consider using strcpy_s instead. To disable deprecation, use _CRT_SECURE_NO_WARNINGS. See online help for details.
14> C:\Program Files (x86)\Microsoft Visual Studio 10.0\VC\include\string.h(105) : see declaration of 'strcpy'
14>c:\users\alex\desktop\server\source launcher v1\eterpack\EterPack.h(5): fatal error C1083: Cannot open include file: 'boost/unordered_map.hpp': No such file or directory
14> EterPackManager.cpp
8>c:\users\alex\desktop\server\source launcher v1\eterbase\cipher.h(8): fatal error C1083: Cannot open include file: 'cryptopp/cryptlib.h': No such file or directory
8> CPostIt.cpp
14>c:\users\alex\desktop\server\source launcher v1\eterbase\filename.h(236): warning C4996: 'strcpy': This function or variable may be unsafe. Consider using strcpy_s instead. To disable deprecation, use _CRT_SECURE_NO_WARNINGS. See online help for details.
14> C:\Program Files (x86)\Microsoft Visual Studio 10.0\VC\include\string.h(105) : see declaration of 'strcpy'
14>c:\users\alex\desktop\server\source launcher v1\eterpack\EterPackManager.h(4): fatal error C1083: Cannot open include file: 'boost/unordered_map.hpp': No such file or directory
14> EterPackPolicy_CSHybridCrypt.cpp
8> CRC32.cpp
14>c:\users\alex\desktop\server\source launcher v1\eterbase\filename.h(236): warning C4996: 'strcpy': This function or variable may be unsafe. Consider using strcpy_s instead. To disable deprecation, use _CRT_SECURE_NO_WARNINGS. See online help for details.
14> C:\Program Files (x86)\Microsoft Visual Studio 10.0\VC\include\string.h(105) : see declaration of 'strcpy'
14>c:\users\alex\desktop\server\source launcher v1\eterpack\EterPackPolicy_CSHybridCrypt.h(4): fatal error C1083: Cannot open include file: 'boost/unordered_map.hpp': No such file or directory
14> StdAfx.cpp
8> Debug.cpp
14>c:\users\alex\desktop\server\source launcher v1\eterbase\filename.h(236): warning C4996: 'strcpy': This function or variable may be unsafe. Consider using strcpy_s instead. To disable deprecation, use _CRT_SECURE_NO_WARNINGS. See online help for details.
14> C:\Program Files (x86)\Microsoft Visual Studio 10.0\VC\include\string.h(105) : see declaration of 'strcpy'
14> Generating Code...
8> error.cpp
14>
14>Build FAILED.
14>
14>Time Elapsed 00:00:02.09
8> FileBase.cpp
8> FileDir.cpp
8> FileLoader.cpp
8> lzo.cpp
8>lzo.cpp(3): fatal error C1083: Cannot open include file: 'lzo-2.03/lzoLibLink.h': No such file or directory
8> MappedFile.cpp
8>c:\users\alex\desktop\server\source launcher v1\eterbase\lzo.h(5): fatal error C1083: Cannot open include file: 'lzo-2.03/lzo1x.h': No such file or directory
8> Random.cpp
8> StdAfx.cpp
8> Stl.cpp
8> tea.cpp
8> TempFile.cpp
8> Timer.cpp
8> Generating Code...
8> Compiling...
8> Utils.cpp
8>Utils.cpp(340): warning C4127: conditional expression is constant
8> Generating Code...
8>c:\users\alex\desktop\server\source launcher v1\eterbase\utils.cpp(627): warning C4706: assignment within conditional expression
6> DXTCImage.cpp
6>c:\users\alex\desktop\server\source launcher v1\eterimagelib\StdAfx.h(33): warning C4996: '_vsnprintf': This function or variable may be unsafe. Consider using _vsnprintf_s instead. To disable deprecation, use _CRT_SECURE_NO_WARNINGS. See online help for details.
6> C:\Program Files (x86)\Microsoft Visual Studio 10.0\VC\include\stdio.h(363) : see declaration of '_vsnprintf'
6>DXTCImage.cpp(4): fatal error C1083: Cannot open include file: 'd3d.h': No such file or directory
6> Image.cpp
6>c:\users\alex\desktop\server\source launcher v1\eterimagelib\StdAfx.h(33): warning C4996: '_vsnprintf': This function or variable may be unsafe. Consider using _vsnprintf_s instead. To disable deprecation, use _CRT_SECURE_NO_WARNINGS. See online help for details.
6> C:\Program Files (x86)\Microsoft Visual Studio 10.0\VC\include\stdio.h(363) : see declaration of '_vsnprintf'
6> TGAImage.cpp
6>c:\users\alex\desktop\server\source launcher v1\eterimagelib\StdAfx.h(33): warning C4996: '_vsnprintf': This function or variable may be unsafe. Consider using _vsnprintf_s instead. To disable deprecation, use _CRT_SECURE_NO_WARNINGS. See online help for details.
6> C:\Program Files (x86)\Microsoft Visual Studio 10.0\VC\include\stdio.h(363) : see declaration of '_vsnprintf'
6>c:\users\alex\desktop\server\source launcher v1\eterbase\lzo.h(5): fatal error C1083: Cannot open include file: 'lzo-2.03/lzo1x.h': No such file or directory
6> Generating Code...
8>
8>Build FAILED.
8>
8>Time Elapsed 00:00:10.91
6>
6>Build FAILED.
6>
6>Time Elapsed 00:00:11.06
16>------ Rebuild All started: Project: UserInterface, Configuration: Release Win32 ------
16>Build started 7/8/2016 7:29:38 AM.
16>Project file contains ToolsVersion="12.0". This toolset may be unknown or missing, in which case you may be able to resolve this by installing the appropriate version of MSBuild, or the build may have been forced to a particular ToolsVersion for policy reasons. Treating the project as if it had ToolsVersion="4.0". For more information, please see http://go.microsoft.com/fwlink/?LinkId=291333.
16>Project file contains ToolsVersion="12.0". This toolset may be unknown or missing, in which case you may be able to resolve this by installing the appropriate version of MSBuild, or the build may have been forced to a particular ToolsVersion for policy reasons. Treating the project as if it had ToolsVersion="4.0". For more information, please see http://go.microsoft.com/fwlink/?LinkId=291333.
16>Project file contains ToolsVersion="12.0". This toolset may be unknown or missing, in which case you may be able to resolve this by installing the appropriate version of MSBuild, or the build may have been forced to a particular ToolsVersion for policy reasons. Treating the project as if it had ToolsVersion="4.0". For more information, please see http://go.microsoft.com/fwlink/?LinkId=291333.
16>C:\Program Files (x86)\MSBuild\Microsoft.Cpp\v4.0\Platforms\Win32\Microsoft.Cpp.Win32.Targets(511,5): error MSB8008: Specified platform toolset (v120_xp) is not installed or invalid. Please make sure that a supported PlatformToolset value is selected.
16>
16>Build FAILED.
16>
16>Time Elapsed 00:00:00.10
========== Rebuild All: 2 succeeded, 14 failed, 0 skipped ==========
Folosesc Visual 2010,cu 2008 nu merge sa-l deschid.Care e solutia?
Avatar utilizator
GameruBandit
Nivel 3

Nivel 3
Mesaje: 353
Membru din: 02 Mai 2016, 23:27
Server: Loading. . .
Regat: Jinno
Aprecieri: 0
Mulţumiri: 15  
 Contact:
Medalii

Foarte simplu rezolvati 2008 ! Ca cu 2008 se complieaza sursa ta ! Si inca ceva Vezi ca ai foarte multe erori in ea!
Imagine
Afișează semnătura
Avatar utilizator
Fikri
Nivel 2

Nivel 2
Mesaje: 180
Membru din: 05 Iul 2015, 11:38
Aprecieri: 19  
Mulţumiri: 3  
Medalii

cu 2008 imi da eroare,nici nu o pot deschide.
Avatar utilizator
GameruBandit
Nivel 3

Nivel 3
Mesaje: 353
Membru din: 02 Mai 2016, 23:27
Server: Loading. . .
Regat: Jinno
Aprecieri: 0
Mulţumiri: 15  
 Contact:
Medalii

.. Lasa-mi ce eroare iti da in visual studio 2008
Imagine
Afișează semnătura
Avatar utilizator
Fikri
Nivel 2

Nivel 2
Mesaje: 180
Membru din: 05 Iul 2015, 11:38
Aprecieri: 19  
Mulţumiri: 3  
Medalii

GameruBandit scrie:.. Lasa-mi ce eroare iti da in visual studio 2008

Care? iceimg.net/images/2016/07/08/Untitled.md.png
Avatar utilizator
GameruBandit
Nivel 3

Nivel 3
Mesaje: 353
Membru din: 02 Mai 2016, 23:27
Server: Loading. . .
Regat: Jinno
Aprecieri: 0
Mulţumiri: 15  
 Contact:
Medalii

si dai pe 2008!
Imagine
Afișează semnătura
Avatar utilizator
Fikri
Nivel 2

Nivel 2
Mesaje: 180
Membru din: 05 Iul 2015, 11:38
Aprecieri: 19  
Mulţumiri: 3  
Medalii

Care versiune? :|
Avatar utilizator
GameruBandit
Nivel 3

Nivel 3
Mesaje: 353
Membru din: 02 Mai 2016, 23:27
Server: Loading. . .
Regat: Jinno
Aprecieri: 0
Mulţumiri: 15  
 Contact:
Medalii

Versiunea Basic!
Imagine
Afișează semnătura
Avatar utilizator
Fikri
Nivel 2

Nivel 2
Mesaje: 180
Membru din: 05 Iul 2015, 11:38
Aprecieri: 19  
Mulţumiri: 3  
Medalii

Avatar utilizator
Zerant :3
Nivel 4

Nivel 4
Mesaje: 723
Membru din: 17 Oct 2015, 12:53
Server: Velor2
Regat: Jinno
Aprecieri: 15  
Mulţumiri: 141  
Discord: Copiază ID
Medalii

Subiect vechi >> Arhivat
Închis
Răspunsuri
14
Vizualizări
1419
Răspunsuri
10
Vizualizări
3228
Răspunsuri
11
Vizualizări
2291
Răspunsuri
0
Vizualizări
50

Înapoi la “Arhivă Probleme şi Întrebări”

  • Informaţie