Stie cineva ce semnifica erorile acestea ? Vreau sa compilez sursa dar imi da erorile astea si vreau sa incerc sa rezolv xD
Cod: Selectaţi tot
compile char_battle.cpp
gmake: *** [OBJDIR/BattleArena.o] Error 1
gmake: *** Waiting for unfinished jobs....
gmake: *** [OBJDIR/acce.o] Error 1
In file included from char.cpp:72:
offlineshop_config.h:33:7: warning: no newline at end of file
char.cpp:7743: warning: this decimal constant is unsigned only in ISO C90
char.cpp:7753: warning: this decimal constant is unsigned only in ISO C90
char.cpp:7779:2: warning: no newline at end of file
In file included from OXEvent.cpp:9:
char.h:743: error: expected ';' before 'void'
In file included from ani.cpp:11:
char.h:743: error: expected ';' before 'void'
gmake: *** [OBJDIR/ani.o] Error 1
In file included from battle.cpp:5:
char.h:743: error: expected ';' before 'void'
gmake: *** [OBJDIR/OXEvent.o] Error 1
In file included from char.cpp:6:
char.h:743: error: expected ';' before 'void'
In file included from arena.cpp:9:
char.h:743: error: expected ';' before 'void'
In file included from char_affect.cpp:5:
char.h:743: error: expected ';' before 'void'
In file included from castle.cpp:21:
char.h:743: error: expected ';' before 'void'
In file included from building.cpp:8:
char.h:743: error: expected ';' before 'void'
gmake: *** [OBJDIR/arena.o] Error 1
char_affect.cpp: In member function 'void CHARACTER::ClearAffect(bool)':
char_affect.cpp:217: error: 'CheckMaximumPoints' was not declared in this scope
char_affect.cpp: In member function 'int CHARACTER::ProcessAffect()':
char_affect.cpp:338: error: 'CheckMaximumPoints' was not declared in this scope
char_affect.cpp: In member function 'bool CHARACTER::RemoveAffect(CAffect*)':
char_affect.cpp:699: error: 'CheckMaximumPoints' was not declared in this scope
gmake: *** [OBJDIR/battle.o] Error 1
gmake: *** [OBJDIR/char_affect.o] Error 1
gmake: *** [OBJDIR/castle.o] Error 1
In file included from battle.h:4,
from char_battle.cpp:10:
char.h:743: error: expected ';' before 'void'
gmake: *** [OBJDIR/building.o] Error 1
char.cpp:3094: error: no 'void CHARACTER::CheckMaximumPoints()' member function declared in class 'CHARACTER'
char.cpp: In member function 'void CHARACTER::PointChange(BYTE, int, bool, bool) ':
char.cpp:3173: warning: comparison between signed and unsigned integer expressio ns
char.cpp: At global scope:
char.cpp:3747: error: no 'void CHARACTER::SendPetLevelUpEffect(int, int, int, in t)' member function declared in class 'CHARACTER'
char.cpp: In member function 'bool CHARACTER::Follow(CHARACTER*, float)':
char.cpp:5954: warning: unused variable 'rot'
char.cpp:5955: error: 'rot' was not declared in this scope
char.cpp:5961: error: 'rot_delta' was not declared in this scope
char.cpp:5955: warning: unused variable 'delta'
char.cpp: At global scope:
char.cpp:5986: error: expected constructor, destructor, or type conversion befor e '(' token
utils.h:12: error: too few arguments to function 'float DISTANCE_SQRT(long int, long int)'
char.cpp:5988: error: at this point in file
char.cpp:5990: error: expected unqualified-id before 'if'
char.cpp:5991: error: expected unqualified-id before 'return'
char.cpp:5995: error: expected unqualified-id before 'if'
char_battle.cpp: In function 'void GiveExp(CHARACTER*, CHARACTER*, int)':
char_battle.cpp:2558: error: expected primary-expression before 'namespace'
char_battle.cpp:2558: error: expected `;' before 'namespace'
char_battle.cpp:3683: error: expected `}' at end of input
char_battle.cpp:3683: error: expected `}' at end of input
gmake: *** [OBJDIR/char.o] Error 1
char_battle.cpp: At global scope:
char_battle.cpp:2364: warning: 'void GiveExp(CHARACTER*, CHARACTER*, int)' defin ed but not used
gmake: *** [OBJDIR/char_battle.o] Error 1

