Eroare Compilare Game

Totalitatea subiectelor care nu respectă regulamentul impus in sectiunea "Probleme şi Întrebări" vor fi stocate aici.
Închis
Avatar utilizator
Xtreme4Ro
Nou Venit

Nou Venit
Mesaje: 27
Membru din: 20 Mar 2015, 07:20
Server: mmo.eliteofgames.com
Regat: Shinsoo
Aprecieri: 0
Mulţumiri: 1  
Medalii

Buna ziua.
Am si eu o problema la compilarea unui game.

Cod: Selectaţi tot

root@metin254:/usr/src/Server/game/src # gmake -j20
compile OXEvent.cpp
compile TrafficProfiler.cpp
compile acce.cpp
In file included from desc.h:7,
                 from OXEvent.cpp:12:
cipher.h:6:31: error: cryptopp/cryptlib.h: No such file or directory
compile ani.cpp
compile arena.cpp
compile banword.cpp
In file included from desc.h:7,
                 from OXEvent.cpp:12:
cipher.h:52: error: 'CryptoPP' has not been declared
cipher.h:52: error: ISO C++ forbids declaration of 'SymmetricCipher' with no type
cipher.h:52: error: expected ';' before '*' token
cipher.h:53: error: 'CryptoPP' has not been declared
cipher.h:53: error: ISO C++ forbids declaration of 'SymmetricCipher' with no type
cipher.h:53: error: expected ';' before '*' token
cipher.h: In member function 'void Cipher::Encrypt(void*, size_t)':
cipher.h:31: error: 'encoder_' was not declared in this scope
cipher.h:31: error: 'byte' was not declared in this scope
cipher.h:31: error: expected primary-expression before ')' token
cipher.h:31: error: ISO C++ forbids declaration of 'type name' with no type
cipher.h:31: error: ISO C++ forbids declaration of 'type name' with no type
cipher.h:31: error: expected primary-expression before 'const'
cipher.h:31: error: expected `)' before 'const'
cipher.h: In member function 'void Cipher::Decrypt(void*, size_t)':
cipher.h:39: error: 'decoder_' was not declared in this scope
cipher.h:39: error: 'byte' was not declared in this scope
cipher.h:39: error: expected primary-expression before ')' token
cipher.h:39: error: ISO C++ forbids declaration of 'type name' with no type
cipher.h:39: error: ISO C++ forbids declaration of 'type name' with no type
cipher.h:39: error: expected primary-expression before 'const'
cipher.h:39: error: expected `)' before 'const'
gmake: *** [Makefile:131: OBJDIR/OXEvent.o] Error 1
gmake: *** Waiting for unfinished jobs....
In file included from desc.h:7,
                 from arena.cpp:5:
cipher.h:6:31: error: cryptopp/cryptlib.h: No such file or directory
In file included from desc.h:7,
                 from arena.cpp:5:
cipher.h:52: error: 'CryptoPP' has not been declared
cipher.h:52: error: ISO C++ forbids declaration of 'SymmetricCipher' with no type
cipher.h:52: error: expected ';' before '*' token
cipher.h:53: error: 'CryptoPP' has not been declared
cipher.h:53: error: ISO C++ forbids declaration of 'SymmetricCipher' with no type
cipher.h:53: error: expected ';' before '*' token
cipher.h: In member function 'void Cipher::Encrypt(void*, size_t)':
cipher.h:31: error: 'encoder_' was not declared in this scope
cipher.h:31: error: 'byte' was not declared in this scope
cipher.h:31: error: expected primary-expression before ')' token
cipher.h:31: error: ISO C++ forbids declaration of 'type name' with no type
cipher.h:31: error: ISO C++ forbids declaration of 'type name' with no type
cipher.h:31: error: expected primary-expression before 'const'
cipher.h:31: error: expected `)' before 'const'
cipher.h: In member function 'void Cipher::Decrypt(void*, size_t)':
cipher.h:39: error: 'decoder_' was not declared in this scope
cipher.h:39: error: 'byte' was not declared in this scope
cipher.h:39: error: expected primary-expression before ')' token
cipher.h:39: error: ISO C++ forbids declaration of 'type name' with no type
cipher.h:39: error: ISO C++ forbids declaration of 'type name' with no type
cipher.h:39: error: expected primary-expression before 'const'
cipher.h:39: error: expected `)' before 'const'
acce.cpp: In function 'void FN_remove_material(CItem**, DWORD, int, int)':
acce.cpp:87: warning: unused variable 'count'
acce.cpp: In function 'bool Acce_InformationInitialize()':
acce.cpp:954: warning: comparison between signed and unsigned integer expressions
gmake: *** [Makefile:131: OBJDIR/arena.o] Error 1
root@metin254:/usr/src/Server/game/src #
Daca ma poate ajuta cineva ar fi minunat :) .
Multumesc
Închis
Răspunsuri
10
Vizualizări
616
Răspunsuri
3
Vizualizări
160
Răspunsuri
6
Vizualizări
320
Răspunsuri
3
Vizualizări
266

Înapoi la “Arhivă Probleme şi Întrebări”

  • Informaţie
  • Cine este conectat

    Utilizatori ce ce navighează pe acest forum: Bing [Bot] și 31 vizitatori