Problema binary

Totalitatea subiectelor care nu respectă regulamentul impus in sectiunea "Probleme şi Întrebări" vor fi stocate aici.
Închis
Avatar utilizator
[Tupeu]
Membru de Elita

Membru de Elita
Mesaje: 4101
Membru din: 28 Oct 2015, 16:16
Aprecieri: 35  
Mulţumiri: 2304  
 Contact:
Medalii

Stie careva de ce primesc toate erorile astea la compilare sursa binary?
Doar pe visual studio 2013 face asa. Am incercat sa il reinstalez si degeaba.

Cod: Selectaţi tot

1>------ Rebuild All started: Project: EterLocale, Configuration: Release Win32 ------
2>------ Rebuild All started: Project: CWebBrowser, Configuration: Release Win32 ------
2>C:\Program Files (x86)\MSBuild\Microsoft\VisualStudio\v12.0\CodeAnalysis\Microsoft.CodeAnalysis.targets(214,5): error : The source file for this compilation can be found at: "C:\Users\Bogdi1\AppData\Local\Temp\bd283613-1e0d-4825-819c-2e58ed3bf6b3.txt"
2>C:\Program Files (x86)\MSBuild\Microsoft\VisualStudio\v12.0\CodeAnalysis\Microsoft.CodeAnalysis.targets(214,5): error MSB3758: An error has occurred during compilation. error CS0009: Metadata file 'c:\Windows\Microsoft.NET\assembly\GAC_MSIL\System.Core\v4.0_4.0.0.0__b77a5c561934e089\System.Core.dll' could not be opened -- 'An attempt was made to load a program with an incorrect format. '
2>C:\Program Files (x86)\MSBuild\Microsoft\VisualStudio\v12.0\CodeAnalysis\Microsoft.CodeAnalysis.targets(214,5): error MSB4036: The "SetEnvironmentVariable" task was not found. Check the following: 1.) The name of the task in the project file is the same as the name of the task class. 2.) The task class is "public" and implements the Microsoft.Build.Framework.ITask interface. 3.) The task is correctly declared with <UsingTask> in the project file, or in the *.tasks files located in the "C:\Program Files (x86)\MSBuild\12.0\bin" directory.
1>C:\Program Files (x86)\MSBuild\Microsoft\VisualStudio\v12.0\CodeAnalysis\Microsoft.CodeAnalysis.targets(214,5): error : The source file for this compilation can be found at: "C:\Users\Bogdi1\AppData\Local\Temp\2225a586-3a60-4f72-9492-2c4c7f56c762.txt"
1>C:\Program Files (x86)\MSBuild\Microsoft\VisualStudio\v12.0\CodeAnalysis\Microsoft.CodeAnalysis.targets(214,5): error MSB3758: An error has occurred during compilation. error CS0009: Metadata file 'c:\Windows\Microsoft.NET\assembly\GAC_MSIL\System.Core\v4.0_4.0.0.0__b77a5c561934e089\System.Core.dll' could not be opened -- 'An attempt was made to load a program with an incorrect format. '
1>C:\Program Files (x86)\MSBuild\Microsoft\VisualStudio\v12.0\CodeAnalysis\Microsoft.CodeAnalysis.targets(214,5): error MSB4036: The "SetEnvironmentVariable" task was not found. Check the following: 1.) The name of the task in the project file is the same as the name of the task class. 2.) The task class is "public" and implements the Microsoft.Build.Framework.ITask interface. 3.) The task is correctly declared with <UsingTask> in the project file, or in the *.tasks files located in the "C:\Program Files (x86)\MSBuild\12.0\bin" directory.
3>------ Rebuild All started: Project: EffectLib, Configuration: Release Win32 ------
4>------ Rebuild All started: Project: EterBase, Configuration: Release Win32 ------
4>C:\Program Files (x86)\MSBuild\Microsoft\VisualStudio\v12.0\CodeAnalysis\Microsoft.CodeAnalysis.targets(214,5): error : The source file for this compilation can be found at: "C:\Users\Bogdi1\AppData\Local\Temp\20d3766a-ebcf-4aff-8a14-0b1badbdf58f.txt"
4>C:\Program Files (x86)\MSBuild\Microsoft\VisualStudio\v12.0\CodeAnalysis\Microsoft.CodeAnalysis.targets(214,5): error MSB3758: An error has occurred during compilation. error CS0009: Metadata file 'c:\Windows\Microsoft.NET\assembly\GAC_MSIL\System.Core\v4.0_4.0.0.0__b77a5c561934e089\System.Core.dll' could not be opened -- 'An attempt was made to load a program with an incorrect format. '
4>C:\Program Files (x86)\MSBuild\Microsoft\VisualStudio\v12.0\CodeAnalysis\Microsoft.CodeAnalysis.targets(214,5): error MSB4036: The "SetEnvironmentVariable" task was not found. Check the following: 1.) The name of the task in the project file is the same as the name of the task class. 2.) The task class is "public" and implements the Microsoft.Build.Framework.ITask interface. 3.) The task is correctly declared with <UsingTask> in the project file, or in the *.tasks files located in the "C:\Program Files (x86)\MSBuild\12.0\bin" directory.
3>C:\Program Files (x86)\MSBuild\Microsoft\VisualStudio\v12.0\CodeAnalysis\Microsoft.CodeAnalysis.targets(214,5): error : The source file for this compilation can be found at: "C:\Users\Bogdi1\AppData\Local\Temp\45361a94-d821-447b-8953-5b4cbbf37b16.txt"
3>C:\Program Files (x86)\MSBuild\Microsoft\VisualStudio\v12.0\CodeAnalysis\Microsoft.CodeAnalysis.targets(214,5): error MSB3758: An error has occurred during compilation. error CS0009: Metadata file 'c:\Windows\Microsoft.NET\assembly\GAC_MSIL\System.Core\v4.0_4.0.0.0__b77a5c561934e089\System.Core.dll' could not be opened -- 'An attempt was made to load a program with an incorrect format. '
3>C:\Program Files (x86)\MSBuild\Microsoft\VisualStudio\v12.0\CodeAnalysis\Microsoft.CodeAnalysis.targets(214,5): error MSB4036: The "SetEnvironmentVariable" task was not found. Check the following: 1.) The name of the task in the project file is the same as the name of the task class. 2.) The task class is "public" and implements the Microsoft.Build.Framework.ITask interface. 3.) The task is correctly declared with <UsingTask> in the project file, or in the *.tasks files located in the "C:\Program Files (x86)\MSBuild\12.0\bin" directory.
5>------ Rebuild All started: Project: EterGrnLib, Configuration: Release Win32 ------
5>C:\Program Files (x86)\MSBuild\Microsoft\VisualStudio\v12.0\CodeAnalysis\Microsoft.CodeAnalysis.targets(214,5): error : The source file for this compilation can be found at: "C:\Users\Bogdi1\AppData\Local\Temp\8a1792fe-5a5b-423e-bc72-2f3859bd8603.txt"
5>C:\Program Files (x86)\MSBuild\Microsoft\VisualStudio\v12.0\CodeAnalysis\Microsoft.CodeAnalysis.targets(214,5): error MSB3758: An error has occurred during compilation. error CS0009: Metadata file 'c:\Windows\Microsoft.NET\assembly\GAC_MSIL\System.Core\v4.0_4.0.0.0__b77a5c561934e089\System.Core.dll' could not be opened -- 'An attempt was made to load a program with an incorrect format. '
5>C:\Program Files (x86)\MSBuild\Microsoft\VisualStudio\v12.0\CodeAnalysis\Microsoft.CodeAnalysis.targets(214,5): error MSB4036: The "SetEnvironmentVariable" task was not found. Check the following: 1.) The name of the task in the project file is the same as the name of the task class. 2.) The task class is "public" and implements the Microsoft.Build.Framework.ITask interface. 3.) The task is correctly declared with <UsingTask> in the project file, or in the *.tasks files located in the "C:\Program Files (x86)\MSBuild\12.0\bin" directory.
6>------ Rebuild All started: Project: EterImageLib, Configuration: Release Win32 ------
7>------ Rebuild All started: Project: EterLib, Configuration: Release Win32 ------
6>C:\Program Files (x86)\MSBuild\Microsoft\VisualStudio\v12.0\CodeAnalysis\Microsoft.CodeAnalysis.targets(214,5): error : The source file for this compilation can be found at: "C:\Users\Bogdi1\AppData\Local\Temp\bc9f54a4-c495-4c36-9c46-84f32e1e7f53.txt"
6>C:\Program Files (x86)\MSBuild\Microsoft\VisualStudio\v12.0\CodeAnalysis\Microsoft.CodeAnalysis.targets(214,5): error MSB3758: An error has occurred during compilation. error CS0009: Metadata file 'c:\Windows\Microsoft.NET\assembly\GAC_MSIL\System.Core\v4.0_4.0.0.0__b77a5c561934e089\System.Core.dll' could not be opened -- 'An attempt was made to load a program with an incorrect format. '
6>C:\Program Files (x86)\MSBuild\Microsoft\VisualStudio\v12.0\CodeAnalysis\Microsoft.CodeAnalysis.targets(214,5): error MSB4036: The "SetEnvironmentVariable" task was not found. Check the following: 1.) The name of the task in the project file is the same as the name of the task class. 2.) The task class is "public" and implements the Microsoft.Build.Framework.ITask interface. 3.) The task is correctly declared with <UsingTask> in the project file, or in the *.tasks files located in the "C:\Program Files (x86)\MSBuild\12.0\bin" directory.
7>C:\Program Files (x86)\MSBuild\Microsoft\VisualStudio\v12.0\CodeAnalysis\Microsoft.CodeAnalysis.targets(214,5): error : The source file for this compilation can be found at: "C:\Users\Bogdi1\AppData\Local\Temp\cff500d8-f2c0-4fa4-a754-d5bb6a388963.txt"
7>C:\Program Files (x86)\MSBuild\Microsoft\VisualStudio\v12.0\CodeAnalysis\Microsoft.CodeAnalysis.targets(214,5): error MSB3758: An error has occurred during compilation. error CS0009: Metadata file 'c:\Windows\Microsoft.NET\assembly\GAC_MSIL\System.Core\v4.0_4.0.0.0__b77a5c561934e089\System.Core.dll' could not be opened -- 'An attempt was made to load a program with an incorrect format. '
7>C:\Program Files (x86)\MSBuild\Microsoft\VisualStudio\v12.0\CodeAnalysis\Microsoft.CodeAnalysis.targets(214,5): error MSB4036: The "SetEnvironmentVariable" task was not found. Check the following: 1.) The name of the task in the project file is the same as the name of the task class. 2.) The task class is "public" and implements the Microsoft.Build.Framework.ITask interface. 3.) The task is correctly declared with <UsingTask> in the project file, or in the *.tasks files located in the "C:\Program Files (x86)\MSBuild\12.0\bin" directory.
8>------ Rebuild All started: Project: EterPack, Configuration: Release Win32 ------
8>C:\Program Files (x86)\MSBuild\Microsoft\VisualStudio\v12.0\CodeAnalysis\Microsoft.CodeAnalysis.targets(214,5): error : The source file for this compilation can be found at: "C:\Users\Bogdi1\AppData\Local\Temp\435d4582-22fa-49fa-9aa5-b7c5859fbe22.txt"
8>C:\Program Files (x86)\MSBuild\Microsoft\VisualStudio\v12.0\CodeAnalysis\Microsoft.CodeAnalysis.targets(214,5): error MSB3758: An error has occurred during compilation. error CS0009: Metadata file 'c:\Windows\Microsoft.NET\assembly\GAC_MSIL\System.Core\v4.0_4.0.0.0__b77a5c561934e089\System.Core.dll' could not be opened -- 'An attempt was made to load a program with an incorrect format. '
8>C:\Program Files (x86)\MSBuild\Microsoft\VisualStudio\v12.0\CodeAnalysis\Microsoft.CodeAnalysis.targets(214,5): error MSB4036: The "SetEnvironmentVariable" task was not found. Check the following: 1.) The name of the task in the project file is the same as the name of the task class. 2.) The task class is "public" and implements the Microsoft.Build.Framework.ITask interface. 3.) The task is correctly declared with <UsingTask> in the project file, or in the *.tasks files located in the "C:\Program Files (x86)\MSBuild\12.0\bin" directory.
9>------ Rebuild All started: Project: EterPythonLib, Configuration: Release Win32 ------
10>------ Rebuild All started: Project: GameLib, Configuration: Release Win32 ------
9>C:\Program Files (x86)\MSBuild\Microsoft\VisualStudio\v12.0\CodeAnalysis\Microsoft.CodeAnalysis.targets(214,5): error : The source file for this compilation can be found at: "C:\Users\Bogdi1\AppData\Local\Temp\f4e0ce45-9b61-46d9-b71e-b8fa615ee2cf.txt"
9>C:\Program Files (x86)\MSBuild\Microsoft\VisualStudio\v12.0\CodeAnalysis\Microsoft.CodeAnalysis.targets(214,5): error MSB3758: An error has occurred during compilation. error CS0009: Metadata file 'c:\Windows\Microsoft.NET\assembly\GAC_MSIL\System.Core\v4.0_4.0.0.0__b77a5c561934e089\System.Core.dll' could not be opened -- 'An attempt was made to load a program with an incorrect format. '
9>C:\Program Files (x86)\MSBuild\Microsoft\VisualStudio\v12.0\CodeAnalysis\Microsoft.CodeAnalysis.targets(214,5): error MSB4036: The "SetEnvironmentVariable" task was not found. Check the following: 1.) The name of the task in the project file is the same as the name of the task class. 2.) The task class is "public" and implements the Microsoft.Build.Framework.ITask interface. 3.) The task is correctly declared with <UsingTask> in the project file, or in the *.tasks files located in the "C:\Program Files (x86)\MSBuild\12.0\bin" directory.
10>C:\Program Files (x86)\MSBuild\Microsoft\VisualStudio\v12.0\CodeAnalysis\Microsoft.CodeAnalysis.targets(214,5): error : The source file for this compilation can be found at: "C:\Users\Bogdi1\AppData\Local\Temp\8f05447a-c158-45ed-8a9e-fec7eea22b23.txt"
10>C:\Program Files (x86)\MSBuild\Microsoft\VisualStudio\v12.0\CodeAnalysis\Microsoft.CodeAnalysis.targets(214,5): error MSB3758: An error has occurred during compilation. error CS0009: Metadata file 'c:\Windows\Microsoft.NET\assembly\GAC_MSIL\System.Core\v4.0_4.0.0.0__b77a5c561934e089\System.Core.dll' could not be opened -- 'An attempt was made to load a program with an incorrect format. '
10>C:\Program Files (x86)\MSBuild\Microsoft\VisualStudio\v12.0\CodeAnalysis\Microsoft.CodeAnalysis.targets(214,5): error MSB4036: The "SetEnvironmentVariable" task was not found. Check the following: 1.) The name of the task in the project file is the same as the name of the task class. 2.) The task class is "public" and implements the Microsoft.Build.Framework.ITask interface. 3.) The task is correctly declared with <UsingTask> in the project file, or in the *.tasks files located in the "C:\Program Files (x86)\MSBuild\12.0\bin" directory.
11>------ Rebuild All started: Project: MilesLib, Configuration: Release Win32 ------
11>C:\Program Files (x86)\MSBuild\Microsoft\VisualStudio\v12.0\CodeAnalysis\Microsoft.CodeAnalysis.targets(214,5): error : The source file for this compilation can be found at: "C:\Users\Bogdi1\AppData\Local\Temp\9f223a7c-7ba1-4692-b967-635fe37840d5.txt"
11>C:\Program Files (x86)\MSBuild\Microsoft\VisualStudio\v12.0\CodeAnalysis\Microsoft.CodeAnalysis.targets(214,5): error MSB3758: An error has occurred during compilation. error CS0009: Metadata file 'c:\Windows\Microsoft.NET\assembly\GAC_MSIL\System.Core\v4.0_4.0.0.0__b77a5c561934e089\System.Core.dll' could not be opened -- 'An attempt was made to load a program with an incorrect format. '
11>C:\Program Files (x86)\MSBuild\Microsoft\VisualStudio\v12.0\CodeAnalysis\Microsoft.CodeAnalysis.targets(214,5): error MSB4036: The "SetEnvironmentVariable" task was not found. Check the following: 1.) The name of the task in the project file is the same as the name of the task class. 2.) The task class is "public" and implements the Microsoft.Build.Framework.ITask interface. 3.) The task is correctly declared with <UsingTask> in the project file, or in the *.tasks files located in the "C:\Program Files (x86)\MSBuild\12.0\bin" directory.
12>------ Rebuild All started: Project: PRTerrainLib, Configuration: Release Win32 ------
12>C:\Program Files (x86)\MSBuild\Microsoft\VisualStudio\v12.0\CodeAnalysis\Microsoft.CodeAnalysis.targets(214,5): error : The source file for this compilation can be found at: "C:\Users\Bogdi1\AppData\Local\Temp\bc73b222-fa7f-442b-b938-bcc9583d4761.txt"
12>C:\Program Files (x86)\MSBuild\Microsoft\VisualStudio\v12.0\CodeAnalysis\Microsoft.CodeAnalysis.targets(214,5): error MSB3758: An error has occurred during compilation. error CS0009: Metadata file 'c:\Windows\Microsoft.NET\assembly\GAC_MSIL\System.Core\v4.0_4.0.0.0__b77a5c561934e089\System.Core.dll' could not be opened -- 'An attempt was made to load a program with an incorrect format. '
12>C:\Program Files (x86)\MSBuild\Microsoft\VisualStudio\v12.0\CodeAnalysis\Microsoft.CodeAnalysis.targets(214,5): error MSB4036: The "SetEnvironmentVariable" task was not found. Check the following: 1.) The name of the task in the project file is the same as the name of the task class. 2.) The task class is "public" and implements the Microsoft.Build.Framework.ITask interface. 3.) The task is correctly declared with <UsingTask> in the project file, or in the *.tasks files located in the "C:\Program Files (x86)\MSBuild\12.0\bin" directory.
13>------ Rebuild All started: Project: ScriptLib, Configuration: Release Win32 ------
14>------ Rebuild All started: Project: SpeedTreeLib, Configuration: Release Win32 ------
14>C:\Program Files (x86)\MSBuild\Microsoft\VisualStudio\v12.0\CodeAnalysis\Microsoft.CodeAnalysis.targets(214,5): error : The source file for this compilation can be found at: "C:\Users\Bogdi1\AppData\Local\Temp\9949837e-f238-42b3-a444-baff012f3fbc.txt"
14>C:\Program Files (x86)\MSBuild\Microsoft\VisualStudio\v12.0\CodeAnalysis\Microsoft.CodeAnalysis.targets(214,5): error MSB3758: An error has occurred during compilation. error CS0009: Metadata file 'c:\Windows\Microsoft.NET\assembly\GAC_MSIL\System.Core\v4.0_4.0.0.0__b77a5c561934e089\System.Core.dll' could not be opened -- 'An attempt was made to load a program with an incorrect format. '
14>C:\Program Files (x86)\MSBuild\Microsoft\VisualStudio\v12.0\CodeAnalysis\Microsoft.CodeAnalysis.targets(214,5): error MSB4036: The "SetEnvironmentVariable" task was not found. Check the following: 1.) The name of the task in the project file is the same as the name of the task class. 2.) The task class is "public" and implements the Microsoft.Build.Framework.ITask interface. 3.) The task is correctly declared with <UsingTask> in the project file, or in the *.tasks files located in the "C:\Program Files (x86)\MSBuild\12.0\bin" directory.
13>C:\Program Files (x86)\MSBuild\Microsoft\VisualStudio\v12.0\CodeAnalysis\Microsoft.CodeAnalysis.targets(214,5): error : The source file for this compilation can be found at: "C:\Users\Bogdi1\AppData\Local\Temp\9f52fd24-7b7d-4e9b-8bd5-5f4d3f650ced.txt"
13>C:\Program Files (x86)\MSBuild\Microsoft\VisualStudio\v12.0\CodeAnalysis\Microsoft.CodeAnalysis.targets(214,5): error MSB3758: An error has occurred during compilation. error CS0009: Metadata file 'c:\Windows\Microsoft.NET\assembly\GAC_MSIL\System.Core\v4.0_4.0.0.0__b77a5c561934e089\System.Core.dll' could not be opened -- 'An attempt was made to load a program with an incorrect format. '
13>C:\Program Files (x86)\MSBuild\Microsoft\VisualStudio\v12.0\CodeAnalysis\Microsoft.CodeAnalysis.targets(214,5): error MSB4036: The "SetEnvironmentVariable" task was not found. Check the following: 1.) The name of the task in the project file is the same as the name of the task class. 2.) The task class is "public" and implements the Microsoft.Build.Framework.ITask interface. 3.) The task is correctly declared with <UsingTask> in the project file, or in the *.tasks files located in the "C:\Program Files (x86)\MSBuild\12.0\bin" directory.
15>------ Rebuild All started: Project: SphereLib, Configuration: Release Win32 ------
15>C:\Program Files (x86)\MSBuild\Microsoft\VisualStudio\v12.0\CodeAnalysis\Microsoft.CodeAnalysis.targets(214,5): error : The source file for this compilation can be found at: "C:\Users\Bogdi1\AppData\Local\Temp\cdb47e55-126f-4b80-860f-f4f883ee6e2a.txt"
15>C:\Program Files (x86)\MSBuild\Microsoft\VisualStudio\v12.0\CodeAnalysis\Microsoft.CodeAnalysis.targets(214,5): error MSB3758: An error has occurred during compilation. error CS0009: Metadata file 'c:\Windows\Microsoft.NET\assembly\GAC_MSIL\System.Core\v4.0_4.0.0.0__b77a5c561934e089\System.Core.dll' could not be opened -- 'An attempt was made to load a program with an incorrect format. '
15>C:\Program Files (x86)\MSBuild\Microsoft\VisualStudio\v12.0\CodeAnalysis\Microsoft.CodeAnalysis.targets(214,5): error MSB4036: The "SetEnvironmentVariable" task was not found. Check the following: 1.) The name of the task in the project file is the same as the name of the task class. 2.) The task class is "public" and implements the Microsoft.Build.Framework.ITask interface. 3.) The task is correctly declared with <UsingTask> in the project file, or in the *.tasks files located in the "C:\Program Files (x86)\MSBuild\12.0\bin" directory.
16>------ Rebuild All started: Project: UserInterface, Configuration: Release Win32 ------
16>C:\Program Files (x86)\MSBuild\Microsoft\VisualStudio\v12.0\CodeAnalysis\Microsoft.CodeAnalysis.targets(214,5): error : The source file for this compilation can be found at: "C:\Users\Bogdi1\AppData\Local\Temp\4e4cc7dc-851e-40d2-96b1-68e3df9a3d5b.txt"
16>C:\Program Files (x86)\MSBuild\Microsoft\VisualStudio\v12.0\CodeAnalysis\Microsoft.CodeAnalysis.targets(214,5): error MSB3758: An error has occurred during compilation. error CS0009: Metadata file 'c:\Windows\Microsoft.NET\assembly\GAC_MSIL\System.Core\v4.0_4.0.0.0__b77a5c561934e089\System.Core.dll' could not be opened -- 'An attempt was made to load a program with an incorrect format. '
16>C:\Program Files (x86)\MSBuild\Microsoft\VisualStudio\v12.0\CodeAnalysis\Microsoft.CodeAnalysis.targets(214,5): error MSB4036: The "SetEnvironmentVariable" task was not found. Check the following: 1.) The name of the task in the project file is the same as the name of the task class. 2.) The task class is "public" and implements the Microsoft.Build.Framework.ITask interface. 3.) The task is correctly declared with <UsingTask> in the project file, or in the *.tasks files located in the "C:\Program Files (x86)\MSBuild\12.0\bin" directory.
========== Rebuild All: 0 succeeded, 16 failed, 0 skipped ==========
Avatar utilizator
DanyRDS
Ţepar / Untrusted User

Ţepar / Untrusted User
Mesaje: 721
Membru din: 29 Noi 2013, 13:55
Server: Coming-Soon
Regat: Jinno
Aprecieri: 206  
Mulţumiri: 35  
Discord: Copiază ID
 Contact:
Medalii

Exact asta o am si eu , UP !
Afișează semnătura
Avatar utilizator
r_tw1x1
Membru Club

Membru Club
Mesaje: 2278
Membru din: 06 Mar 2015, 18:33
Server: Nirvana3
Regat: Jinno
Aprecieri: 228  
Mulţumiri: 3790  
  Rezolvări prob.: 1
Discord: Copiază ID
Medalii

Ce binary ai compilat? Ai instalat complet vs 2013?
Imagine
Imagine
Afișează semnătura
Avatar utilizator
[Tupeu]
Membru de Elita

Membru de Elita
Mesaje: 4101
Membru din: 28 Oct 2015, 16:16
Aprecieri: 35  
Mulţumiri: 2304  
 Contact:
Medalii

SoLuS scrie:Ce binary ai compilat? Ai instalat complet vs 2013?
Binary 2metin. E instalat complet.

[ Postat de pe Android ] Imagine
Avatar utilizator
[Tupeu]
Membru de Elita

Membru de Elita
Mesaje: 4101
Membru din: 28 Oct 2015, 16:16
Aprecieri: 35  
Mulţumiri: 2304  
 Contact:
Medalii

up. Careva?
Avatar utilizator
spkmafya
Nou Venit

Nou Venit
Mesaje: 47
Membru din: 19 Dec 2013, 13:40
Server: THL
Regat: Jinno
Aprecieri: 43  
Mulţumiri: 1  
Medalii

subiect inactiv, arhivat
Închis
Răspunsuri
6
Vizualizări
436
Răspunsuri
6
Vizualizări
517
Răspunsuri
2
Vizualizări
284
Răspunsuri
2
Vizualizări
79

Înapoi la “Arhivă Probleme şi Întrebări”

  • Informaţie
  • Cine este conectat

    Utilizatori ce ce navighează pe acest forum: Niciun utilizator înregistrat și 54 vizitatori