Problema sursa

Închis
Avatar utilizator
darkallience3
Nivel 6

Nivel 6
Mesaje: 952
Membru din: 17 Dec 2013, 15:03
Server: Metin2Andromeda
Regat: Jinno
Aprecieri: 294  
Mulţumiri: 183  
Medalii

Salut just4metin , am sa va las aici code cu erorile de la sursa (nu imi compileaza launcherul)

Cod: Selectaţi tot

1>------ Build started: Project: scriptLib, Configuration: Release Win32 ------
1>Compiling...
1>StdAfx.cpp
1>e:\sursalauncher\scriptlib\../eterLib/StdAfx.h(23) : fatal error C1083: Cannot open include file: 'd3d8.h': No such file or directory
1>Build log was saved at "file://e:\SursaLauncher\ScriptLib\Release\BuildLog.htm"
1>scriptLib - 1 error(s), 0 warning(s)
2>------ Build started: Project: mileslib, Configuration: Release Win32 ------
2>Compiling...
2>Stdafx.cpp
2>e:\sursalauncher\mileslib\stdafx.h(12) : fatal error C1083: Cannot open include file: 'mss.h': No such file or directory
2>Build log was saved at "file://e:\SursaLauncher\MilesLib\Release\BuildLog.htm"
2>mileslib - 1 error(s), 0 warning(s)
3>------ Build started: Project: gamelib, Configuration: Release Win32 ------
3>Compiling...
3>StdAfx.cpp
3>e:\sursalauncher\gamelib\../eterLib/StdAfx.h(23) : fatal error C1083: Cannot open include file: 'd3d8.h': No such file or directory
3>Build log was saved at "file://e:\SursaLauncher\GameLib\Release\BuildLog.htm"
3>gamelib - 1 error(s), 0 warning(s)
4>------ Build started: Project: eterlib, Configuration: Release Win32 ------
4>Compiling...
4>StdAfx.cpp
4>e:\sursalauncher\eterlib\stdafx.h(23) : fatal error C1083: Cannot open include file: 'd3d8.h': No such file or directory
4>Build log was saved at "file://e:\SursaLauncher\EterLib\Release\BuildLog.htm"
4>eterlib - 1 error(s), 0 warning(s)
5>------ Build started: Project: eterPythonLib, Configuration: Release Win32 ------
5>Compiling...
5>StdAfx.cpp
5>e:\sursalauncher\eterpythonlib\../EterLib/StdAfx.h(23) : fatal error C1083: Cannot open include file: 'd3d8.h': No such file or directory
5>Build log was saved at "file://e:\SursaLauncher\EterPythonLib\Release\BuildLog.htm"
5>eterPythonLib - 1 error(s), 0 warning(s)
6>------ Build started: Project: eterImageLib, Configuration: Release Win32 ------
6>Compiling...
6>DXTCImage.cpp
6>e:\sursalauncher\eterimagelib\StdAfx.h(33) : warning C4996: '_vsnprintf': This function or variable may be unsafe. Consider using _vsnprintf_s instead. To disable deprecation, use _CRT_SECURE_NO_WARNINGS. See online help for details.
6>        C:\Program Files\Microsoft Visual Studio 9.0\VC\include\stdio.h(358) : see declaration of '_vsnprintf'
6>.\DXTCImage.cpp(4) : fatal error C1083: Cannot open include file: 'd3d.h': No such file or directory
6>TGAImage.cpp
6>e:\sursalauncher\eterimagelib\StdAfx.h(33) : warning C4996: '_vsnprintf': This function or variable may be unsafe. Consider using _vsnprintf_s instead. To disable deprecation, use _CRT_SECURE_NO_WARNINGS. See online help for details.
6>        C:\Program Files\Microsoft Visual Studio 9.0\VC\include\stdio.h(358) : see declaration of '_vsnprintf'
6>e:\sursalauncher\eterbase\lzo.h(5) : fatal error C1083: Cannot open include file: 'lzo-2.03/lzo1x.h': No such file or directory
6>Generating Code...
6>Build log was saved at "file://e:\SursaLauncher\EterImageLib\Release\BuildLog.htm"
6>eterImageLib - 2 error(s), 2 warning(s)
7>------ Build started: Project: eterGrnLib, Configuration: Release Win32 ------
7>Compiling...
7>StdAfx.cpp
7>e:\sursalauncher\etergrnlib\stdafx.h(6) : fatal error C1083: Cannot open include file: 'granny.h': No such file or directory
7>Build log was saved at "file://e:\SursaLauncher\EterGrnLib\Release\BuildLog.htm"
7>eterGrnLib - 1 error(s), 0 warning(s)
8>------ Build started: Project: eterBase, Configuration: Release Win32 ------
8>Compiling...
8>MappedFile.cpp
8>e:\sursalauncher\eterbase\lzo.h(5) : fatal error C1083: Cannot open include file: 'lzo-2.03/lzo1x.h': No such file or directory
8>lzo.cpp
8>.\lzo.cpp(3) : fatal error C1083: Cannot open include file: 'lzo-2.03/lzoLibLink.h': No such file or directory
8>cipher.cpp
8>e:\sursalauncher\eterbase\cipher.h(8) : fatal error C1083: Cannot open include file: 'cryptopp/cryptlib.h': No such file or directory
8>Generating Code...
8>Build log was saved at "file://e:\SursaLauncher\EterBase\Release\BuildLog.htm"
8>eterBase - 3 error(s), 0 warning(s)
9>------ Build started: Project: EffectLib, Configuration: Release Win32 ------
9>Compiling...
9>StdAfx.cpp
9>e:\sursalauncher\effectlib\../eterLib/StdAfx.h(23) : fatal error C1083: Cannot open include file: 'd3d8.h': No such file or directory
9>Build log was saved at "file://e:\SursaLauncher\EffectLib\Release\BuildLog.htm"
9>EffectLib - 1 error(s), 0 warning(s)
10>------ Build started: Project: SphereLib, Configuration: Release Win32 ------
10>Compiling...
10>StdAfx.cpp
10>e:\sursalauncher\spherelib\stdafx.h(7) : fatal error C1083: Cannot open include file: 'd3d8.h': No such file or directory
10>Build log was saved at "file://e:\SursaLauncher\SphereLib\Release\BuildLog.htm"
10>SphereLib - 1 error(s), 0 warning(s)
11>------ Build started: Project: SpeedTreeLib, Configuration: Release Win32 ------
11>Compiling...
11>StdAfx.cpp
11>e:\sursalauncher\speedtreelib\SpeedTreeForest.h(35) : fatal error C1083: Cannot open include file: 'SpeedTreeRT.h': No such file or directory
11>Build log was saved at "file://e:\SursaLauncher\SpeedTreeLib\Release\BuildLog.htm"
11>SpeedTreeLib - 1 error(s), 0 warning(s)
12>------ Build started: Project: PRTerrainLib, Configuration: Release Win32 ------
12>Compiling...
12>StdAfx.cpp
12>e:\sursalauncher\prterrainlib\../EterLib/StdAfx.h(23) : fatal error C1083: Cannot open include file: 'd3d8.h': No such file or directory
12>Build log was saved at "file://e:\SursaLauncher\PRTerrainLib\Release\BuildLog.htm"
12>PRTerrainLib - 1 error(s), 0 warning(s)
13>------ Build started: Project: EterPack, Configuration: Release Win32 ------
13>Compiling...
13>EterPackPolicy_CSHybridCrypt.cpp
13>e:\sursalauncher\eterbase\filename.h(236) : warning C4996: 'strcpy': This function or variable may be unsafe. Consider using strcpy_s instead. To disable deprecation, use _CRT_SECURE_NO_WARNINGS. See online help for details.
13>        C:\Program Files\Microsoft Visual Studio 9.0\VC\include\string.h(74) : see declaration of 'strcpy'
13>e:\sursalauncher\eterpack\EterPackPolicy_CSHybridCrypt.h(4) : fatal error C1083: Cannot open include file: 'boost/unordered_map.hpp': No such file or directory
13>EterPackManager.cpp
13>e:\sursalauncher\eterbase\filename.h(236) : warning C4996: 'strcpy': This function or variable may be unsafe. Consider using strcpy_s instead. To disable deprecation, use _CRT_SECURE_NO_WARNINGS. See online help for details.
13>        C:\Program Files\Microsoft Visual Studio 9.0\VC\include\string.h(74) : see declaration of 'strcpy'
13>e:\sursalauncher\eterpack\EterPackManager.h(4) : fatal error C1083: Cannot open include file: 'boost/unordered_map.hpp': No such file or directory
13>EterPackCursor.cpp
13>e:\sursalauncher\eterbase\filename.h(236) : warning C4996: 'strcpy': This function or variable may be unsafe. Consider using strcpy_s instead. To disable deprecation, use _CRT_SECURE_NO_WARNINGS. See online help for details.
13>        C:\Program Files\Microsoft Visual Studio 9.0\VC\include\string.h(74) : see declaration of 'strcpy'
13>e:\sursalauncher\eterpack\EterPack.h(5) : fatal error C1083: Cannot open include file: 'boost/unordered_map.hpp': No such file or directory
13>Generating Code...
13>Build log was saved at "file://e:\SursaLauncher\EterPack\Release\BuildLog.htm"
13>EterPack - 3 error(s), 3 warning(s)
14>------ Build started: Project: UserInterface, Configuration: Release Win32 ------
14>Compiling...
14>StdAfx.cpp
14>e:\sursalauncher\userinterface\../eterLib/StdAfx.h(23) : fatal error C1083: Cannot open include file: 'd3d8.h': No such file or directory
14>Creating browse information file...
14>Microsoft Browse Information Maintenance Utility Version 9.00.30729
14>Copyright (C) Microsoft Corporation. All rights reserved.
14>BSCMAKE: error BK1506 : cannot open file '.\Release\InstanceBase.sbr': No such file or directory
14>Build log was saved at "file://e:\SursaLauncher\UserInterface\Release\BuildLog.htm"
14>UserInterface - 2 error(s), 0 warning(s)
========== Build: 0 succeeded, 14 failed, 2 up-to-date, 0 skipped ==========
Afișează semnătura
Închis

Înapoi la “Arhivă”

  • Informaţie
  • Cine este conectat

    Utilizatori ce ce navighează pe acest forum: Niciun utilizator înregistrat și 3 vizitatori