char_item.cpp: In member function 'void CHARACTER::BuffOnAttr_ValueChange(BYTE, BYTE, BYTE)':
char_item.cpp:6424: error: expected primary-expression before ',' token
char_item.cpp:6426: error: expected `;' before 'static'
char_item.cpp:6427: error: 'vec_slots' was not declared in this scope
char_item.cpp:6422: warning: unused variable 'abSlot'
acce.cpp: In function 'void FN_remove_material(CItem**, DWORD, int, int)':
acce.cpp:87: warning: unused variable 'count'
acce.cpp: In function 'bool Acce_InformationInitialize()':
acce.cpp:943: warning: comparison between signed and unsigned integer expressions
cmd_general.cpp: In function 'void do_costume(CHARACTER*, const char*, int, int)':
cmd_general.cpp
cmd_general.cpp
cmd_general.cpp
cmd_general.cpp: At global scope:
cmd_general.cpp
cmd_general.cpp
gmake: *** [OBJDIR/cmd_general.o] Error 1
gmake: *** Waiting for unfinished jobs....
gmake: *** [OBJDIR/char_item.o] Error 1


daca te-am ajutat


de