am si eu o problema cu compilarea la game..
binary si db merg perfect, doar ca la game nu pot compila...
dau thx..help
Cod: Selectaţi tot
[OK] Se compileaza: BattleArena.cpp
[OK] Se compileaza: FSM.cpp
[OK] Se compileaza: MarkConvert.cpp
[OK] Se compileaza: MarkImage.cpp
[OK] Se compileaza: MarkManager.cpp
[OK] Se compileaza: OXEvent.cpp
[OK] Se compileaza: TrafficProfiler.cpp
[OK] Se compileaza: ani.cpp
[OK] Se compileaza: arena.cpp
[OK] Se compileaza: banword.cpp
[OK] Se compileaza: battle.cpp
[OK] Se compileaza: blend_item.cpp
[OK] Se compileaza: block_country.cpp
[OK] Se compileaza: buffer_manager.cpp
[OK] Se compileaza: building.cpp
[OK] Se compileaza: castle.cpp
[OK] Se compileaza: char.cpp
[OK] Se compileaza: char_affect.cpp
[OK] Se compileaza: char_battle.cpp
[OK] Se compileaza: char_change_empire.cpp
In file included from char.cpp:69:
offlineshop_config.h:33:7: warning: no newline at end of file
[OK] Se compileaza: char_horse.cpp
[OK] Se compileaza: char_item.cpp
[OK] Se compileaza: char_manager.cpp
In file included from char.h:12,
from char_manager.cpp:5:
affect.h:163: error: expected `}' before 'AFF_HAIR'
affect.h:167: error: expected initializer before '}' token
affect.h:167: error: expected declaration before '}' token
In file included from char.h:12,
from char.cpp:6:
affect.h:163: error: expected `}' before 'AFF_HAIR'
affect.h:167: error: expected initializer before '}' token
affect.h:167: error: expected declaration before '}' token
In file included from char.h:12,
from char_item.cpp:7:
affect.h:163: error: expected `}' before 'AFF_HAIR'
affect.h:167: error: expected initializer before '}' token
affect.h:167: error: expected declaration before '}' token
gmake: *** [OBJDIR/char_manager.o] Error 1
gmake: *** Waiting for unfinished jobs....
gmake: *** [OBJDIR/char_item.o] Error 1
In file included from char.h:12,
from ani.cpp:11:
affect.h:163: error: expected `}' before 'AFF_HAIR'
affect.h:167: error: expected initializer before '}' token
affect.h:167: error: expected declaration before '}' token
In file included from char.h:12,
from char_affect.cpp:5:
affect.h:163: error: expected `}' before 'AFF_HAIR'
affect.h:167: error: expected initializer before '}' token
affect.h:167: error: expected declaration before '}' token
In file included from char.h:12,
from BattleArena.cpp:6:
affect.h:163: error: expected `}' before 'AFF_HAIR'
affect.h:167: error: expected initializer before '}' token
affect.h:167: error: expected declaration before '}' token
In file included from char.h:12,
from char_change_empire.cpp:4:
affect.h:163: error: expected `}' before 'AFF_HAIR'
affect.h:167: error: expected initializer before '}' token
affect.h:167: error: expected declaration before '}' token
In file included from char.h:12,
from char_horse.cpp:3:
affect.h:163: error: expected `}' before 'AFF_HAIR'
affect.h:167: error: expected initializer before '}' token
affect.h:167: error: expected declaration before '}' token
In file included from char.h:12,
from castle.cpp:21:
affect.h:163: error: expected `}' before 'AFF_HAIR'
affect.h:167: error: expected initializer before '}' token
affect.h:167: error: expected declaration before '}' token
In file included from char.h:12,
from building.cpp:8:
affect.h:163: error: expected `}' before 'AFF_HAIR'
affect.h:167: error: expected initializer before '}' token
affect.h:167: error: expected declaration before '}' token
In file included from char.h:12,
from battle.cpp:5:
affect.h:163: error: expected `}' before 'AFF_HAIR'
affect.h:167: error: expected initializer before '}' token
affect.h:167: error: expected declaration before '}' token
gmake: *** [OBJDIR/char_change_empire.o] Error 1
In file included from char.h:12,
from OXEvent.cpp:9:
affect.h:163: error: expected `}' before 'AFF_HAIR'
affect.h:167: error: expected initializer before '}' token
affect.h:167: error: expected declaration before '}' token
In file included from char.h:12,
from arena.cpp:9:
affect.h:163: error: expected `}' before 'AFF_HAIR'
affect.h:167: error: expected initializer before '}' token
affect.h:167: error: expected declaration before '}' token
In file included from char.h:12,
from battle.h:4,
from char_battle.cpp:10:
affect.h:163: error: expected `}' before 'AFF_HAIR'
affect.h:167: error: expected initializer before '}' token
affect.h:167: error: expected declaration before '}' token
gmake: *** [OBJDIR/char_horse.o] Error 1
gmake: *** [OBJDIR/char.o] Error 1
gmake: *** [OBJDIR/char_affect.o] Error 1
gmake: *** [OBJDIR/building.o] Error 1
gmake: *** [OBJDIR/castle.o] Error 1
gmake: *** [OBJDIR/ani.o] Error 1
gmake: *** [OBJDIR/BattleArena.o] Error 1
gmake: *** [OBJDIR/battle.o] Error 1
gmake: *** [OBJDIR/char_battle.o] Error 1
gmake: *** [OBJDIR/arena.o] Error 1
gmake: *** [OBJDIR/OXEvent.o] Error 1
linia 167: };


daca te-am ajutat

