Am şi eu o mică problemă la compilarea sursei.. am instalat tot ce aveam nevoie, am început să compilez, iar la final primesc asta :
ABBC3_SPOILER_SHOW
../../../Extern/include/cryptopp/algparam.h: In constructor 'CryptoPP::ConstByte ArrayParameter::ConstByteArrayParameter(const T&, bool) [with T = std::basic_str ing<char, std::char_traits<char>, std::allocator<char> >]':
../../../Extern/include/cryptopp/filters.h:793: instantiated from here
../../../Extern/include/cryptopp/algparam.h:26: warning: unused variable 'crypto pp_assert_26'
../../../Extern/include/cryptopp/algparam.h: In member function 'void CryptoPP:: AlgorithmParametersTemplate<T>::MoveInto(void*) const [with T = CryptoPP::Random NumberGenerator*]':
cipher.cpp:397: instantiated from here
../../../Extern/include/cryptopp/algparam.h:322: warning: unused variable 'p'
[ULTY_CORE] Compiling: DragonSoul.cpp
buff_on_attributes.cpp: In member function 'void CBuffOnAttributes::ChangeBuffVa lue(BYTE)':
buff_on_attributes.cpp:113: warning: unused variable 'old_value'
buff_on_attributes.cpp:114: warning: unused variable 'new_value'
[ULTY_CORE] Compiling: group_text_parse_tree.cpp
[ULTY_CORE] Compiling: char_dragonsoul.cpp
[ULTY_CORE] Compiling: questlua_dragonsoul.cpp
group_text_parse_tree.h: In constructor 'CGroupTextParseTreeLoader::CGroupTextPa rseTreeLoader()':
group_text_parse_tree.h:93: warning: 'CGroupTextParseTreeLoader::m_dwcurLineInde x' will be initialized after
group_text_parse_tree.h:91: warning: 'CGroupNode* CGroupTextParseTreeLoader::m _pRootGroupNode'
group_text_parse_tree.cpp:5: warning: when initialized here
[ULTY_CORE] Compiling: shop_manager.cpp
DragonSoul.cpp: In member function 'bool DSManager::ExtractDragonHeart(CHARACTER *, CItem*, CItem*)':
DragonSoul.cpp:350: warning: unused variable 'sum'
DragonSoul.cpp: In member function 'bool DSManager::PullOut(CHARACTER*, TItemPos , CItem*&, CItem*)':
DragonSoul.cpp:435: warning: unused variable 'dwVnum'
DragonSoul.cpp: In member function 'bool DSManager::DoRefineGrade(CHARACTER*, TI temPos (&)[15])':
DragonSoul.cpp:555: warning: unused variable 'prob_sum'
DragonSoul.cpp: In member function 'bool DSManager::DoRefineStep(CHARACTER*, TIt emPos (&)[15])':
DragonSoul.cpp:763: warning: unused variable 'sum'
[ULTY_CORE] Compiling: shopEx.cpp
[ULTY_CORE] Compiling: item_manager_read_tables.cpp
[ULTY_CORE] Compiling: minilzo.c
item_manager_read_tables.cpp: In member function 'bool ITEM_MANAGER::ReadMonster DropItemGroup(const char*)':
item_manager_read_tables.cpp:637: warning: unused variable 'pkGroup'
item_manager_read_tables.cpp:627: warning: 'pkGroup' may be used uninitialized i n this function
../../../Extern/include/cryptopp/misc.h: At global scope:
../../../Extern/include/cryptopp/misc.h:548: warning: 'std::string CryptoPP::Str ingNarrow(const wchar_t*, bool)' defined but not used
--------------------------------------------------------------
---- ULTY_CORE GAME PREMIUM © ----
---- ULTY CORE : ../game_r64250_32 - Succesfully job ! ----
--------------------------------------------------------------
linking ../ulty_core_r64250_striped
/usr/bin/ld: cannot find -lanticpxsvr
gmake: *** [Makefile:141: ../game_r64250_32] Error 1
gmake: *** Waiting for unfinished jobs....
/usr/bin/ld: cannot find -lanticpxsvr
gmake: *** [Makefile:145: ../ulty_core_r64250_striped] Error 1
../../../Extern/include/cryptopp/filters.h:793: instantiated from here
../../../Extern/include/cryptopp/algparam.h:26: warning: unused variable 'crypto pp_assert_26'
../../../Extern/include/cryptopp/algparam.h: In member function 'void CryptoPP:: AlgorithmParametersTemplate<T>::MoveInto(void*) const [with T = CryptoPP::Random NumberGenerator*]':
cipher.cpp:397: instantiated from here
../../../Extern/include/cryptopp/algparam.h:322: warning: unused variable 'p'
[ULTY_CORE] Compiling: DragonSoul.cpp
buff_on_attributes.cpp: In member function 'void CBuffOnAttributes::ChangeBuffVa lue(BYTE)':
buff_on_attributes.cpp:113: warning: unused variable 'old_value'
buff_on_attributes.cpp:114: warning: unused variable 'new_value'
[ULTY_CORE] Compiling: group_text_parse_tree.cpp
[ULTY_CORE] Compiling: char_dragonsoul.cpp
[ULTY_CORE] Compiling: questlua_dragonsoul.cpp
group_text_parse_tree.h: In constructor 'CGroupTextParseTreeLoader::CGroupTextPa rseTreeLoader()':
group_text_parse_tree.h:93: warning: 'CGroupTextParseTreeLoader::m_dwcurLineInde x' will be initialized after
group_text_parse_tree.h:91: warning: 'CGroupNode* CGroupTextParseTreeLoader::m _pRootGroupNode'
group_text_parse_tree.cpp:5: warning: when initialized here
[ULTY_CORE] Compiling: shop_manager.cpp
DragonSoul.cpp: In member function 'bool DSManager::ExtractDragonHeart(CHARACTER *, CItem*, CItem*)':
DragonSoul.cpp:350: warning: unused variable 'sum'
DragonSoul.cpp: In member function 'bool DSManager::PullOut(CHARACTER*, TItemPos , CItem*&, CItem*)':
DragonSoul.cpp:435: warning: unused variable 'dwVnum'
DragonSoul.cpp: In member function 'bool DSManager::DoRefineGrade(CHARACTER*, TI temPos (&)[15])':
DragonSoul.cpp:555: warning: unused variable 'prob_sum'
DragonSoul.cpp: In member function 'bool DSManager::DoRefineStep(CHARACTER*, TIt emPos (&)[15])':
DragonSoul.cpp:763: warning: unused variable 'sum'
[ULTY_CORE] Compiling: shopEx.cpp
[ULTY_CORE] Compiling: item_manager_read_tables.cpp
[ULTY_CORE] Compiling: minilzo.c
item_manager_read_tables.cpp: In member function 'bool ITEM_MANAGER::ReadMonster DropItemGroup(const char*)':
item_manager_read_tables.cpp:637: warning: unused variable 'pkGroup'
item_manager_read_tables.cpp:627: warning: 'pkGroup' may be used uninitialized i n this function
../../../Extern/include/cryptopp/misc.h: At global scope:
../../../Extern/include/cryptopp/misc.h:548: warning: 'std::string CryptoPP::Str ingNarrow(const wchar_t*, bool)' defined but not used
--------------------------------------------------------------
---- ULTY_CORE GAME PREMIUM © ----
---- ULTY CORE : ../game_r64250_32 - Succesfully job ! ----
--------------------------------------------------------------
linking ../ulty_core_r64250_striped
/usr/bin/ld: cannot find -lanticpxsvr
gmake: *** [Makefile:141: ../game_r64250_32] Error 1
gmake: *** Waiting for unfinished jobs....
/usr/bin/ld: cannot find -lanticpxsvr
gmake: *** [Makefile:145: ../ulty_core_r64250_striped] Error 1





