Compilare sursa Binary

Totalitatea subiectelor care nu respectă regulamentul impus in sectiunea "Probleme şi Întrebări" vor fi stocate aici.
Închis
Avatar utilizator
TysonDMG
Nivel 3

Nivel 3
Mesaje: 407
Membru din: 03 Dec 2013, 18:39
Aprecieri: 140  
Mulţumiri: 3  
Medalii

Salut, am descarcat acce system cel a lui lennt dar intampinn o problema ..
16>PythonApplication.obj : error LNK2001: unresolved external symbol "public: __thiscall CPythonAcce::CPythonAcce(void)" (??0CPythonAcce@@QAE@XZ)
16>PythonApplication.obj : error LNK2001: unresolved external symbol "public: virtual __thiscall CPythonAcce::~CPythonAcce(void)" (??1CPythonAcce@@UAE@XZ)
16>PythonNetworkStreamPhaseGame.obj : error LNK2001: unresolved external symbol "public: void __thiscall CPythonAcce::Clear(void)" (?Clear@CPythonAcce@@QAEXXZ)
16>PythonNetworkStreamPhaseGame.obj : error LNK2001: unresolved external symbol "public: void __thiscall CPythonAcce::AddMaterial(unsigned long,unsigned char,struct SItemPos)" (?AddMaterial@CPythonAcce@@QAEXKEUSItemPos@@@Z)
16>PythonNetworkStreamPhaseGame.obj : error LNK2001: unresolved external symbol "public: void __thiscall CPythonAcce::AddResult(unsigned long,unsigned long,unsigned long)" (?AddResult@CPythonAcce@@QAEXKKK@Z)
16>PythonNetworkStreamPhaseGame.obj : error LNK2001: unresolved external symbol "public: void __thiscall CPythonAcce::RemoveMaterial(unsigned long,unsigned char)" (?RemoveMaterial@CPythonAcce@@QAEXKE@Z)
16>UserInterface.obj : error LNK2001: unresolved external symbol "void __cdecl initAcce(void)" (?initAcce@@YAXXZ)
16>D:\[SERVER]\Resurse\Source binary\binary\Metin2Distribute.exe : fatal error LNK1120: 7 unresolved externals
========== Build: 15 succeeded, 1 failed, 0 up-to-date, 0 skipped ==========
un ajutor va rog?
Ultima oară modificat 12 Aug 2017, 17:48 de către TysonDMG, modificat 1 dată în total.
Avatar utilizator
[RaffaeL]
Software Developer

Software Developer
Mesaje: 3223
Membru din: 19 Mar 2016, 12:58
Server: ...
Aprecieri: 15  
Mulţumiri: 2502  
  Rezolvări prob.: 2
Discord: Copiază ID
 Contact:
Medalii

kakalurmu1 scrie:Salut, am descarcat acce system cel a lui lennt dar intamin o problema la GameLib..
1>..\..\source\GameLib\ActorInstanceAttach.cpp(613): error C2039: 'PART_ACCE' : is not a member of 'CRaceData'
1> d:\[server]\resurse\source binary\source\gamelib\RaceData.h(14) : see declaration of 'CRaceData'
1>..\..\source\GameLib\ActorInstanceAttach.cpp(613): error C2065: 'PART_ACCE' : undeclared identifier
1>..\..\source\GameLib\ActorInstanceAttach.cpp(614): error C2039: 'PART_ACCE' : is not a member of 'CRaceData'
1> d:\[server]\resurse\source binary\source\gamelib\RaceData.h(14) : see declaration of 'CRaceData'
1>..\..\source\GameLib\ActorInstanceAttach.cpp(614): error C2065: 'PART_ACCE' : undeclared identifier
1> d:\[server]\resurse\source binary\source\gamelib\RaceData.h(14) : see declaration of 'CRaceData'
1>..\..\source\GameLib\ActorInstanceAttach.cpp(619): error C2039: 'PART_ACCE' : is not a member of 'CRaceData'
1> d:\[server]\resurse\source binary\source\gamelib\RaceData.h(14) : see declaration of 'CRaceData'
1>..\..\source\GameLib\ActorInstanceAttach.cpp(619): error C2065: 'PART_ACCE' : undeclared identifier
1>..\..\source\GameLib\ActorInstanceAttach.cpp(620): error C2039: 'PART_ACCE' : is not a member of 'CRaceData'
1> d:\[server]\resurse\source binary\source\gamelib\RaceData.h(14) : see declaration of 'CRaceData'
1>..\..\source\GameLib\ActorInstanceAttach.cpp(620): error C2065: 'PART_ACCE' : undeclared identifier
1> d:\[server]\resurse\source binary\source\gamelib\RaceData.h(14) : see declaration of 'CRaceData'
1>..\..\source\GameLib\ActorInstanceAttach.cpp(621): error C2039: 'PART_ACCE' : is not a member of 'CRaceData'
1> d:\[server]\resurse\source binary\source\gamelib\RaceData.h(14) : see declaration of 'CRaceData'
1>..\..\source\GameLib\ActorInstanceAttach.cpp(621): error C2065: 'PART_ACCE' : undeclared identifier
1>..\..\source\GameLib\ActorInstanceAttach.cpp(630): error C2039: 'PART_ACCE' : is not a member of 'CRaceData'
1> d:\[server]\resurse\source binary\source\gamelib\RaceData.h(14) : see declaration of 'CRaceData'
1>..\..\source\GameLib\ActorInstanceAttach.cpp(630): error C2065: 'PART_ACCE' : undeclared identifier
un ajutor va rog?
Refa implementarea atent.Ai uitat sa adaugi ceva.(Dupa cate vad nu ai declarat PART ACCE deloc.)
Imagine
Imagine
https://www.youtube.com/watch?v=GhYkCIETEto
Do everything, if you know what you're doing, else... Imagine
Ma gasesti si aici: Discord https://discord.gg/5J5GnyZVSR
Afișează semnătura
Avatar utilizator
Syxov
Nivel 10

Nivel 10
Mesaje: 2197
Membru din: 18 Sep 2016, 17:34
Server: SonyMt2
Regat: Jinno
Aprecieri: 70  
Mulţumiri: 138  
Discord: Copiază ID
Medalii

WarningSubiect inactiv , arhivat !
Imagine
Afișează semnătura
Închis
Răspunsuri
3
Vizualizări
719
Răspunsuri
1
Vizualizări
217
Răspunsuri
12
Vizualizări
1087
Răspunsuri
17
Vizualizări
407

Înapoi la “Arhivă Probleme şi Întrebări”

  • Informaţie