Offline Shop - compile

Înainte de a posta o problemă, caută în acest forum și poate găsești rezolvare.
Închis
Avatar utilizator
enzicz
Nivel 1

Nivel 1
Mesaje: 68
Membru din: 22 Feb 2014, 12:38
Aprecieri: 43  
Mulţumiri: 4  
Medalii

Hi.. Today i tried to add Offline Shop (Ken) but i have some error in compile :/

Cod: Selectaţi tot

input_main.cpp: In member function 'int CInputMain::MyOfflineShop(CHARACTER*, const char*, size_t)':
input_main.cpp:3206: error: 'TPacketCGMyOfflineShop' was not declared in this scope
input_main.cpp:3206: error: 'p' was not declared in this scope
input_main.cpp:3206: error: expected primary-expression before ')' token
input_main.cpp:3206: error: expected `;' before 'c_pData'
gmake: *** [OBJDIR/input_main.o] Error 1
gmake: *** Waiting for unfinished jobs....
Here is input_main.cpp

Someone know ho to fix it ? :(
Avatar utilizator
maic
Membru Club

Membru Club
Mesaje: 936
Membru din: 20 Sep 2015, 18:00
Aprecieri: 37  
Mulţumiri: 1331  
Discord: Copiază ID
Medalii

Take a look in packet.h and packet_info.cpp at TPacketCGMyOfflineShop.

[ Postat de pe iPhone ] Imagine
Pentru acest mesaj, maic for the post:
enzicz
ImagineImagine
Afișează semnătura
Avatar utilizator
enzicz
Nivel 1

Nivel 1
Mesaje: 68
Membru din: 22 Feb 2014, 12:38
Aprecieri: 43  
Mulţumiri: 4  
Medalii

Fixxed :) ty
Închis

Înapoi la “Probleme rezolvate”

  • Informaţie