Rezolvare warning compilare sursa game

Totalitatea subiectelor care nu respectă regulamentul impus in sectiunea "Probleme şi Întrebări" vor fi stocate aici.
Avatar utilizator
R4uL.T
Nou Venit

Nou Venit
Mesaje: 16
Membru din: 02 Ian 2017, 18:32
Server: a
Regat: Chunjo
Aprecieri: 0
Mulţumiri: 1  
Medalii

*Problemă: Salutare J4M, v-as ruga daca ma puteti ajuta sa rezolv niste warninguri la compilarea sursei game.
Tipologie server: PvM - PvP
*Resursă folosită: J4M Gazer
*ServerFiles utilizat: Gazer
*Syserr:
compile BattleArena.cpp
compile FSM.cpp
compile MarkConvert.cpp
compile MarkImage.cpp
compile MarkManager.cpp
compile OXEvent.cpp
compile TrafficProfiler.cpp
compile ani.cpp
compile arena.cpp
compile banword.cpp
compile battle.cpp
compile blend_item.cpp
compile block_country.cpp
compile buffer_manager.cpp
compile building.cpp
compile castle.cpp
gmake: Warning: File `exchange.h' has modification time 32438 s in the future
compile char.cpp
compile char_affect.cpp
compile char_battle.cpp
compile char_change_empire.cpp
compile char_horse.cpp
compile char_item.cpp
char_item.cpp: In member function 'void CHARACTER::BuffOnAttr_ValueChange(BYTE, BYTE, BYTE)':
char_item.cpp:6337: warning: 'pBuff' may be used uninitialized in this function
compile char_manager.cpp
compile char_quickslot.cpp
compile char_resist.cpp
compile char_skill.cpp
compile char_state.cpp
compile PetSystem.cpp
PetSystem.cpp: In member function 'virtual bool CPetActor::_UpdateFollowAI()':
PetSystem.cpp:246: warning: unused variable 'bDoMoveAlone'
PetSystem.cpp: In member function 'CPetActor* CPetSystem::Summon(DWORD, CItem*, const char*, bool, DWORD)':
PetSystem.cpp:552: warning: unused variable 'petVID'
compile cmd.cpp
compile cmd_emotion.cpp
compile cmd_general.cpp
compile cmd_gm.cpp
cmd_gm.cpp:2121:9: warning: multi-character character constant
compile cmd_oxevent.cpp
compile config.cpp
config.cpp: In function 'void config_init(const std::string&)':
config.cpp:434: warning: NULL used in arithmetic
config.cpp:458: warning: NULL used in arithmetic
config.cpp:482: warning: NULL used in arithmetic
config.cpp:504: warning: unused variable 'line'
compile constants.cpp
compile crc32.cpp
compile cube.cpp
compile acce.cpp
acce.cpp: In function 'void FN_remove_material(CItem**, DWORD, int, int)':
acce.cpp:87: warning: unused variable 'count'
acce.cpp: In function 'bool Acce_InformationInitialize()':
acce.cpp:943: warning: comparison between signed and unsigned integer expressions
compile db.cpp
compile desc.cpp
compile desc_client.cpp
compile desc_manager.cpp
compile desc_p2p.cpp
compile dev_log.cpp
compile dungeon.cpp
compile empire_text_convert.cpp
compile entity.cpp
compile entity_view.cpp
compile event.cpp
compile event_queue.cpp
compile exchange.cpp
compile file_loader.cpp
compile fishing.cpp
compile gm.cpp
compile guild.cpp
compile guild_manager.cpp
compile guild_war.cpp
compile horse_rider.cpp
compile horsename_manager.cpp
compile input.cpp
compile input_auth.cpp
compile input_db.cpp
compile input_login.cpp
compile input_main.cpp
compile input_p2p.cpp
compile input_teen.cpp
compile input_udp.cpp
compile ip_ban.cpp
compile item.cpp
compile item_addon.cpp
compile item_attribute.cpp
compile item_manager.cpp
compile item_manager_idrange.cpp
compile locale.cpp
compile locale_service.cpp
compile log.cpp
compile login_data.cpp
compile lzo_manager.cpp
compile marriage.cpp
compile matrix_card.cpp
compile messenger_manager.cpp
compile mining.cpp
compile mob_manager.cpp
compile monarch.cpp
compile motion.cpp
compile over9refine.cpp
compile p2p.cpp
compile packet_info.cpp
compile party.cpp
compile passpod.cpp
compile pcbang.cpp
compile polymorph.cpp
compile priv_manager.cpp
compile pvp.cpp
compile questevent.cpp
compile questlua.cpp
compile questlua_affect.cpp
compile questlua_arena.cpp
compile questlua_ba.cpp
compile questlua_building.cpp
compile questlua_danceevent.cpp
compile questlua_dungeon.cpp
compile questlua_forked.cpp
compile questlua_game.cpp
compile questlua_global.cpp
compile questlua_guild.cpp
compile questlua_horse.cpp
compile questlua_pet.cpp
compile questlua_item.cpp
compile questlua_marriage.cpp
compile questlua_mgmt.cpp
compile questlua_monarch.cpp
compile questlua_npc.cpp
questlua_npc.cpp: In function 'int quest::npc_get_vid_attack_mul(lua_State*)':
questlua_npc.cpp:293: warning: unused variable 'q'
questlua_npc.cpp: In function 'int quest::npc_set_vid_attack_mul(lua_State*)':
questlua_npc.cpp:309: warning: unused variable 'q'
questlua_npc.cpp: In function 'int quest::npc_get_vid_damage_mul(lua_State*)':
questlua_npc.cpp:324: warning: unused variable 'q'
questlua_npc.cpp: In function 'int quest::npc_set_vid_damage_mul(lua_State*)':
questlua_npc.cpp:340: warning: unused variable 'q'
compile questlua_oxevent.cpp
compile questlua_party.cpp
compile questlua_pc.cpp
compile questlua_quest.cpp
compile questlua_target.cpp
compile questmanager.cpp
compile questnpc.cpp
compile questpc.cpp
compile refine.cpp
compile regen.cpp
compile safebox.cpp
compile sectree.cpp
compile sectree_manager.cpp
compile sequence.cpp
compile shop.cpp
compile skill.cpp
compile start_position.cpp
compile target.cpp
compile text_file_loader.cpp
compile trigger.cpp
compile utils.cpp
compile vector.cpp
compile war_map.cpp
compile wedding.cpp
compile xmas_event.cpp
compile version.cpp
compile panama.cpp
compile threeway_war.cpp
compile map_location.cpp
compile auth_brazil.cpp
compile BlueDragon.cpp
compile BlueDragon_Binder.cpp
compile DragonLair.cpp
compile questlua_dragonlair.cpp
compile HackShield.cpp
compile HackShield_Impl.cpp
compile char_hackshield.cpp
compile skill_power.cpp
compile affect.cpp
compile SpeedServer.cpp
compile questlua_speedserver.cpp
compile XTrapManager.cpp
compile auction_manager.cpp
compile FileMonitor_FreeBSD.cpp
compile ClientPackageCryptInfo.cpp
compile cipher.cpp
../../../Extern/include/cryptopp/algparam.h: In constructor 'CryptoPP::ConstByteArrayParameter::ConstByteArrayParameter(const T&, bool) [with T = std::basic_string<char, std::char_traits<char>, std::allocator<char> >]':
../../../Extern/include/cryptopp/filters.h:793: instantiated from here
../../../Extern/include/cryptopp/algparam.h:26: warning: unused variable 'cryptopp_assert_26'
../../../Extern/include/cryptopp/algparam.h: In member function 'void CryptoPP::AlgorithmParametersTemplate<T>::MoveInto(void*) const [with T = CryptoPP::RandomNumberGenerator*]':
cipher.cpp:397: instantiated from here
../../../Extern/include/cryptopp/algparam.h:322: warning: unused variable 'p'
../../../Extern/include/cryptopp/misc.h: At global scope:
../../../Extern/include/cryptopp/misc.h:548: warning: 'std::string CryptoPP::StringNarrow(const wchar_t*, bool)' defined but not used
compile buff_on_attributes.cpp
buff_on_attributes.cpp: In member function 'void CBuffOnAttributes::ChangeBuffValue(BYTE)':
buff_on_attributes.cpp:113: warning: unused variable 'old_value'
buff_on_attributes.cpp:114: warning: unused variable 'new_value'
compile check_server.cpp
compile dragon_soul_table.cpp
compile DragonSoul.cpp
DragonSoul.cpp: In member function 'bool DSManager::ExtractDragonHeart(CHARACTER*, CItem*, CItem*)':
DragonSoul.cpp:350: warning: unused variable 'sum'
DragonSoul.cpp: In member function 'bool DSManager::PullOut(CHARACTER*, TItemPos, CItem*&, CItem*)':
DragonSoul.cpp:435: warning: unused variable 'dwVnum'
DragonSoul.cpp: In member function 'bool DSManager::DoRefineGrade(CHARACTER*, TItemPos (&)[15])':
DragonSoul.cpp:555: warning: unused variable 'prob_sum'
DragonSoul.cpp: In member function 'bool DSManager::DoRefineStep(CHARACTER*, TItemPos (&)[15])':
DragonSoul.cpp:763: warning: unused variable 'sum'
compile group_text_parse_tree.cpp
group_text_parse_tree.h: In constructor 'CGroupTextParseTreeLoader::CGroupTextParseTreeLoader()':
group_text_parse_tree.h:93: warning: 'CGroupTextParseTreeLoader::m_dwcurLineIndex' will be initialized after
group_text_parse_tree.h:91: warning: 'CGroupNode* CGroupTextParseTreeLoader::m_pRootGroupNode'
group_text_parse_tree.cpp:5: warning: when initialized here
compile char_dragonsoul.cpp
compile questlua_dragonsoul.cpp
compile shop_manager.cpp
compile shopEx.cpp
compile item_manager_read_tables.cpp
item_manager_read_tables.cpp: In member function 'bool ITEM_MANAGER::ReadMonsterDropItemGroup(const char*)':
item_manager_read_tables.cpp:637: warning: unused variable 'pkGroup'
item_manager_read_tables.cpp:627: warning: 'pkGroup' may be used uninitialized in this function
compile minilzo.c
compile main.cpp
linking ../game_r40250_32....
compile test.cpp
linking ../test
gmake: warning: Clock skew detected. Your build may be incomplete.
Poză: Nu necesita.
*Detalii suplimentare: Multumesc anticipat , cu stima si respect astept un raspuns de la voi, multumesc anticipat !
Ultima oară modificat 19 Dec 2017, 19:53 de către Spyke, modificat 1 dată în total.
Motiv: Spoiler adaugat!
Avatar utilizator
Moț
Ţepar / Untrusted User

Ţepar / Untrusted User
Mesaje: 2825
Membru din: 03 Apr 2017, 15:00
Aprecieri: 216  
Mulţumiri: 3040  
Discord: Copiază ID
Medalii

Poți dezactiva warningurile introducând -w la CFLAGS(makefile), nu se oferă mai nimeni să-ți rezolve așa ceva gratis, deoarece ii cam plictisitor și necesită timp .

[ Postat de pe Android ] Imagine
Imagine
Afișează semnătura
Avatar utilizator
BRTSERGIU2
Utilizator interzis !

Utilizator interzis !
Mesaje: 600
Membru din: 25 Aug 2014, 21:28
Server: Metin2Ro
Regat: Chunjo
Aprecieri: 28  
Mulţumiri: 77  
Medalii

gmake: Warning: File `exchange.h' has modification time 32438 s in the future
data la care a fost modificat fisierul este in viitor fata de data serverului pe care ai compilat adica
virtual boxu tau are data pusa gresit
te duci in virtualbox/putty si scrii: date 1712191328
17=anu 2017
12=luna
19=ziua
13=ora
28=minutele si pui data corecta
Avatar utilizator
BRTSERGIU2
Utilizator interzis !

Utilizator interzis !
Mesaje: 600
Membru din: 25 Aug 2014, 21:28
Server: Metin2Ro
Regat: Chunjo
Aprecieri: 28  
Mulţumiri: 77  
Medalii

questlua_npc.cpp: In function 'int quest::npc_get_vid_attack_mul(lua_State*)':
questlua_npc.cpp:293: warning: unused variable 'q'
questlua_npc.cpp: In function 'int quest::npc_set_vid_attack_mul(lua_State*)':
questlua_npc.cpp:309: warning: unused variable 'q'
questlua_npc.cpp: In function 'int quest::npc_get_vid_damage_mul(lua_State*)':
questlua_npc.cpp:324: warning: unused variable 'q'
questlua_npc.cpp: In function 'int quest::npc_set_vid_damage_mul(lua_State*)':
questlua_npc.cpp:340: warning: unused variable 'q'

deschizi questlua_npc.cpp te duci la linia 293,309,324,340 si o sa ai ceva de genu:
CQuestManager& q = CQuestManager::instance();
si adaugi sub ea (void)q;

o sa arate asa

CQuestManager& q = CQuestManager::instance();
(void)q;
Avatar utilizator
BRTSERGIU2
Utilizator interzis !

Utilizator interzis !
Mesaje: 600
Membru din: 25 Aug 2014, 21:28
Server: Metin2Ro
Regat: Chunjo
Aprecieri: 28  
Mulţumiri: 77  
Medalii

buff_on_attributes.cpp:113: warning: unused variable 'old_value'
buff_on_attributes.cpp:114: warning: unused variable 'new_value'

te duci la linia 113 si adaugi sub ea (void)old_value;
te duci la linia 114 si adaugi sub ea (void)new_value;

DragonSoul.cpp: In member function 'bool DSManager::ExtractDragonHeart(CHARACTER*, CItem*, CItem*)':
DragonSoul.cpp:350: warning: unused variable 'sum'
DragonSoul.cpp: In member function 'bool DSManager::PullOut(CHARACTER*, TItemPos, CItem*&, CItem*)':
DragonSoul.cpp:435: warning: unused variable 'dwVnum'
DragonSoul.cpp: In member function 'bool DSManager::DoRefineGrade(CHARACTER*, TItemPos (&)[15])':
DragonSoul.cpp:555: warning: unused variable 'prob_sum'
DragonSoul.cpp: In member function 'bool DSManager::DoRefineStep(CHARACTER*, TItemPos (&)[15])':
DragonSoul.cpp:763: warning: unused variable 'sum'
te duci la liniile alea si adaugi sub ele cum ti-am aratat si mai sus (void)sum; etc

item_manager_read_tables.cpp:637: warning: unused variable 'pkGroup'
la fel
Avatar utilizator
BRTSERGIU2
Utilizator interzis !

Utilizator interzis !
Mesaje: 600
Membru din: 25 Aug 2014, 21:28
Server: Metin2Ro
Regat: Chunjo
Aprecieri: 28  
Mulţumiri: 77  
Medalii

group_text_parse_tree.h: In constructor 'CGroupTextParseTreeLoader::CGroupTextParseTreeLoader()':
group_text_parse_tree.h:93: warning: 'CGroupTextParseTreeLoader::m_dwcurLineIndex' will be initialized after
group_text_parse_tree.h:91: warning: 'CGroupNode* CGroupTextParseTreeLoader::m_pRootGroupNode'
group_text_parse_tree.cpp:5: warning: when initialized here

te duci in fisierul group_text_parse_tree.h la linia 93 si fi sigur ca sunt in ordinea asta

DWORD m_dwcurLineIndex;
CGroupNode * m_pRootGroupNode;
std::string m_strFileName;
Avatar utilizator
R4uL.T
Nou Venit

Nou Venit
Mesaje: 16
Membru din: 02 Ian 2017, 18:32
Server: a
Regat: Chunjo
Aprecieri: 0
Mulţumiri: 1  
Medalii

BRTSERGIU scrie:group_text_parse_tree.h: In constructor 'CGroupTextParseTreeLoader::CGroupTextParseTreeLoader()':
group_text_parse_tree.h:93: warning: 'CGroupTextParseTreeLoader::m_dwcurLineIndex' will be initialized after
group_text_parse_tree.h:91: warning: 'CGroupNode* CGroupTextParseTreeLoader::m_pRootGroupNode'
group_text_parse_tree.cpp:5: warning: when initialized here

te duci in fisierul group_text_parse_tree.h la linia 93 si fi sigur ca sunt in ordinea asta

DWORD m_dwcurLineIndex;
CGroupNode * m_pRootGroupNode;
std::string m_strFileName;
uite cum sunt ele:
private:
bool LoadGroup(CGroupNode * pGroupNode);

CGroupNode * m_pRootGroupNode;
std::string m_strFileName;
DWORD m_dwcurLineIndex;

CMemoryTextFileLoader m_fileLoader;
};
Avatar utilizator
BRTSERGIU2
Utilizator interzis !

Utilizator interzis !
Mesaje: 600
Membru din: 25 Aug 2014, 21:28
Server: Metin2Ro
Regat: Chunjo
Aprecieri: 28  
Mulţumiri: 77  
Medalii

R4uL.T scrie:
BRTSERGIU scrie:group_text_parse_tree.h: In constructor 'CGroupTextParseTreeLoader::CGroupTextParseTreeLoader()':
group_text_parse_tree.h:93: warning: 'CGroupTextParseTreeLoader::m_dwcurLineIndex' will be initialized after
group_text_parse_tree.h:91: warning: 'CGroupNode* CGroupTextParseTreeLoader::m_pRootGroupNode'
group_text_parse_tree.cpp:5: warning: when initialized here

te duci in fisierul group_text_parse_tree.h la linia 93 si fi sigur ca sunt in ordinea asta

DWORD m_dwcurLineIndex;
CGroupNode * m_pRootGroupNode;
std::string m_strFileName;
uite cum sunt ele:
private:
bool LoadGroup(CGroupNode * pGroupNode);

CGroupNode * m_pRootGroupNode;
std::string m_strFileName;
DWORD m_dwcurLineIndex;

CMemoryTextFileLoader m_fileLoader;
};

deci in group_text_parse_tree.cpp la linia 6 si trebuie in group_text_parse_tree.h sa le ai in ordine ca acolo eu am asa

: m_dwcurLineIndex(0), m_pRootGroupNode(NULL)

deci in group_text_parse_tree.h am asa

private:
bool LoadGroup(CGroupNode * pGroupNode);

DWORD m_dwcurLineIndex;
CGroupNode * m_pRootGroupNode;
std::string m_strFileName;

CMemoryTextFileLoader m_fileLoader;
};

te uiti cum e ordinea in care sunt scrise in .cpp si in aceeasi ordine le pui si in .h
Avatar utilizator
R4uL.T
Nou Venit

Nou Venit
Mesaje: 16
Membru din: 02 Ian 2017, 18:32
Server: a
Regat: Chunjo
Aprecieri: 0
Mulţumiri: 1  
Medalii

Am urmat ceea ce mi-ati spus sa fac mai sus, iar dupa o compilare rezultatul este acesta:
compile BattleArena.cpp
compile FSM.cpp
compile MarkConvert.cpp
compile MarkImage.cpp
compile MarkManager.cpp
compile OXEvent.cpp
compile TrafficProfiler.cpp
compile ani.cpp
compile arena.cpp
compile banword.cpp
compile battle.cpp
compile blend_item.cpp
compile block_country.cpp
compile buffer_manager.cpp
compile building.cpp
compile castle.cpp
compile char.cpp
compile char_affect.cpp
compile char_battle.cpp
compile char_change_empire.cpp
compile char_horse.cpp
compile char_item.cpp
char_item.cpp: In member function 'void CHARACTER::BuffOnAttr_ValueChange(BYTE, BYTE, BYTE)':
char_item.cpp:6337: warning: 'pBuff' may be used uninitialized in this function
compile char_manager.cpp
compile char_quickslot.cpp
compile char_resist.cpp
compile char_skill.cpp
compile char_state.cpp
compile PetSystem.cpp
PetSystem.cpp: In member function 'virtual bool CPetActor::_UpdateFollowAI()':
PetSystem.cpp:246: warning: unused variable 'bDoMoveAlone'
PetSystem.cpp: In member function 'CPetActor* CPetSystem::Summon(DWORD, CItem*, const char*, bool, DWORD)':
PetSystem.cpp:552: warning: unused variable 'petVID'
compile cmd.cpp
compile cmd_emotion.cpp
compile cmd_general.cpp
compile cmd_gm.cpp
cmd_gm.cpp:2121:9: warning: multi-character character constant
compile cmd_oxevent.cpp
compile config.cpp
config.cpp: In function 'void config_init(const std::string&)':
config.cpp:434: warning: NULL used in arithmetic
config.cpp:458: warning: NULL used in arithmetic
config.cpp:482: warning: NULL used in arithmetic
config.cpp:504: warning: unused variable 'line'
compile constants.cpp
compile crc32.cpp
compile cube.cpp
compile acce.cpp
acce.cpp: In function 'void FN_remove_material(CItem**, DWORD, int, int)':
acce.cpp:87: warning: unused variable 'count'
acce.cpp: In function 'bool Acce_InformationInitialize()':
acce.cpp:943: warning: comparison between signed and unsigned integer expressions
compile db.cpp
compile desc.cpp
compile desc_client.cpp
compile desc_manager.cpp
compile desc_p2p.cpp
compile dev_log.cpp
compile dungeon.cpp
compile empire_text_convert.cpp
compile entity.cpp
compile entity_view.cpp
compile event.cpp
compile event_queue.cpp
compile exchange.cpp
compile file_loader.cpp
compile fishing.cpp
compile gm.cpp
compile guild.cpp
compile guild_manager.cpp
compile guild_war.cpp
compile horse_rider.cpp
compile horsename_manager.cpp
compile input.cpp
compile input_auth.cpp
compile input_db.cpp
compile input_login.cpp
compile input_main.cpp
compile input_p2p.cpp
compile input_teen.cpp
compile input_udp.cpp
compile ip_ban.cpp
compile item.cpp
compile item_addon.cpp
compile item_attribute.cpp
compile item_manager.cpp
compile item_manager_idrange.cpp
compile locale.cpp
compile locale_service.cpp
compile log.cpp
compile login_data.cpp
compile lzo_manager.cpp
compile marriage.cpp
compile matrix_card.cpp
compile messenger_manager.cpp
compile mining.cpp
compile mob_manager.cpp
compile monarch.cpp
compile motion.cpp
compile over9refine.cpp
compile p2p.cpp
compile packet_info.cpp
compile party.cpp
compile passpod.cpp
compile pcbang.cpp
compile polymorph.cpp
compile priv_manager.cpp
compile pvp.cpp
compile questevent.cpp
compile questlua.cpp
compile questlua_affect.cpp
compile questlua_arena.cpp
compile questlua_ba.cpp
compile questlua_building.cpp
compile questlua_danceevent.cpp
compile questlua_dungeon.cpp
compile questlua_forked.cpp
compile questlua_game.cpp
compile questlua_global.cpp
compile questlua_guild.cpp
compile questlua_horse.cpp
compile questlua_pet.cpp
compile questlua_item.cpp
compile questlua_marriage.cpp
compile questlua_mgmt.cpp
compile questlua_monarch.cpp
compile questlua_npc.cpp
compile questlua_oxevent.cpp
compile questlua_party.cpp
compile questlua_pc.cpp
compile questlua_quest.cpp
compile questlua_target.cpp
compile questmanager.cpp
compile questnpc.cpp
compile questpc.cpp
compile refine.cpp
compile regen.cpp
compile safebox.cpp
compile sectree.cpp
compile sectree_manager.cpp
compile sequence.cpp
compile shop.cpp
compile skill.cpp
compile start_position.cpp
compile target.cpp
compile text_file_loader.cpp
compile trigger.cpp
compile utils.cpp
compile vector.cpp
compile war_map.cpp
compile wedding.cpp
compile xmas_event.cpp
compile version.cpp
compile panama.cpp
compile threeway_war.cpp
compile map_location.cpp
compile auth_brazil.cpp
compile BlueDragon.cpp
compile BlueDragon_Binder.cpp
compile DragonLair.cpp
compile questlua_dragonlair.cpp
compile HackShield.cpp
compile HackShield_Impl.cpp
compile char_hackshield.cpp
compile skill_power.cpp
compile affect.cpp
compile SpeedServer.cpp
compile questlua_speedserver.cpp
compile XTrapManager.cpp
compile auction_manager.cpp
compile FileMonitor_FreeBSD.cpp
compile ClientPackageCryptInfo.cpp
compile cipher.cpp
../../../Extern/include/cryptopp/algparam.h: In constructor 'CryptoPP::ConstByteArrayParameter::ConstByteArrayParameter(const T&, bool) [with T = std::basic_string<char, std::char_traits<char>, std::allocator<char> >]':
../../../Extern/include/cryptopp/filters.h:793: instantiated from here
../../../Extern/include/cryptopp/algparam.h:26: warning: unused variable 'cryptopp_assert_26'
../../../Extern/include/cryptopp/algparam.h: In member function 'void CryptoPP::AlgorithmParametersTemplate<T>::MoveInto(void*) const [with T = CryptoPP::RandomNumberGenerator*]':
cipher.cpp:397: instantiated from here
../../../Extern/include/cryptopp/algparam.h:322: warning: unused variable 'p'
../../../Extern/include/cryptopp/misc.h: At global scope:
../../../Extern/include/cryptopp/misc.h:548: warning: 'std::string CryptoPP::StringNarrow(const wchar_t*, bool)' defined but not used
compile buff_on_attributes.cpp
compile check_server.cpp
compile dragon_soul_table.cpp
compile DragonSoul.cpp
DragonSoul.cpp: In member function 'bool DSManager::DoRefineGrade(CHARACTER*, TItemPos (&)[15])':
DragonSoul.cpp:556: error: 'prob_sum' was not declared in this scope
DragonSoul.cpp: In member function 'bool DSManager::DoRefineStep(CHARACTER*, TItemPos (&)[15])':
DragonSoul.cpp:765: warning: unused variable 'sum'
gmake: *** [OBJDIR/DragonSoul.o] Error 1
Ultima oară modificat 19 Dec 2017, 19:54 de către Spyke, modificat 1 dată în total.
Motiv: Spoiler adaugat!
Avatar utilizator
BRTSERGIU2
Utilizator interzis !

Utilizator interzis !
Mesaje: 600
Membru din: 25 Aug 2014, 21:28
Server: Metin2Ro
Regat: Chunjo
Aprecieri: 28  
Mulţumiri: 77  
Medalii

R4uL.T scrie:Am urmat ceea ce mi-ati spus sa fac mai sus, iar dupa o compilare rezultatul este acesta:

compile BattleArena.cpp
compile FSM.cpp
compile MarkConvert.cpp
compile MarkImage.cpp
compile MarkManager.cpp
compile OXEvent.cpp
compile TrafficProfiler.cpp
compile ani.cpp
compile arena.cpp
compile banword.cpp
compile battle.cpp
compile blend_item.cpp
compile block_country.cpp
compile buffer_manager.cpp
compile building.cpp
compile castle.cpp
compile char.cpp
compile char_affect.cpp
compile char_battle.cpp
compile char_change_empire.cpp
compile char_horse.cpp
compile char_item.cpp
char_item.cpp: In member function 'void CHARACTER::BuffOnAttr_ValueChange(BYTE, BYTE, BYTE)':
char_item.cpp:6337: warning: 'pBuff' may be used uninitialized in this function
compile char_manager.cpp
compile char_quickslot.cpp
compile char_resist.cpp
compile char_skill.cpp
compile char_state.cpp
compile PetSystem.cpp
PetSystem.cpp: In member function 'virtual bool CPetActor::_UpdateFollowAI()':
PetSystem.cpp:246: warning: unused variable 'bDoMoveAlone'
PetSystem.cpp: In member function 'CPetActor* CPetSystem::Summon(DWORD, CItem*, const char*, bool, DWORD)':
PetSystem.cpp:552: warning: unused variable 'petVID'
compile cmd.cpp
compile cmd_emotion.cpp
compile cmd_general.cpp
compile cmd_gm.cpp
cmd_gm.cpp:2121:9: warning: multi-character character constant
compile cmd_oxevent.cpp
compile config.cpp
config.cpp: In function 'void config_init(const std::string&)':
config.cpp:434: warning: NULL used in arithmetic
config.cpp:458: warning: NULL used in arithmetic
config.cpp:482: warning: NULL used in arithmetic
config.cpp:504: warning: unused variable 'line'
compile constants.cpp
compile crc32.cpp
compile cube.cpp
compile acce.cpp
acce.cpp: In function 'void FN_remove_material(CItem**, DWORD, int, int)':
acce.cpp:87: warning: unused variable 'count'
acce.cpp: In function 'bool Acce_InformationInitialize()':
acce.cpp:943: warning: comparison between signed and unsigned integer expressions
compile db.cpp
compile desc.cpp
compile desc_client.cpp
compile desc_manager.cpp
compile desc_p2p.cpp
compile dev_log.cpp
compile dungeon.cpp
compile empire_text_convert.cpp
compile entity.cpp
compile entity_view.cpp
compile event.cpp
compile event_queue.cpp
compile exchange.cpp
compile file_loader.cpp
compile fishing.cpp
compile gm.cpp
compile guild.cpp
compile guild_manager.cpp
compile guild_war.cpp
compile horse_rider.cpp
compile horsename_manager.cpp
compile input.cpp
compile input_auth.cpp
compile input_db.cpp
compile input_login.cpp
compile input_main.cpp
compile input_p2p.cpp
compile input_teen.cpp
compile input_udp.cpp
compile ip_ban.cpp
compile item.cpp
compile item_addon.cpp
compile item_attribute.cpp
compile item_manager.cpp
compile item_manager_idrange.cpp
compile locale.cpp
compile locale_service.cpp
compile log.cpp
compile login_data.cpp
compile lzo_manager.cpp
compile marriage.cpp
compile matrix_card.cpp
compile messenger_manager.cpp
compile mining.cpp
compile mob_manager.cpp
compile monarch.cpp
compile motion.cpp
compile over9refine.cpp
compile p2p.cpp
compile packet_info.cpp
compile party.cpp
compile passpod.cpp
compile pcbang.cpp
compile polymorph.cpp
compile priv_manager.cpp
compile pvp.cpp
compile questevent.cpp
compile questlua.cpp
compile questlua_affect.cpp
compile questlua_arena.cpp
compile questlua_ba.cpp
compile questlua_building.cpp
compile questlua_danceevent.cpp
compile questlua_dungeon.cpp
compile questlua_forked.cpp
compile questlua_game.cpp
compile questlua_global.cpp
compile questlua_guild.cpp
compile questlua_horse.cpp
compile questlua_pet.cpp
compile questlua_item.cpp
compile questlua_marriage.cpp
compile questlua_mgmt.cpp
compile questlua_monarch.cpp
compile questlua_npc.cpp
compile questlua_oxevent.cpp
compile questlua_party.cpp
compile questlua_pc.cpp
compile questlua_quest.cpp
compile questlua_target.cpp
compile questmanager.cpp
compile questnpc.cpp
compile questpc.cpp
compile refine.cpp
compile regen.cpp
compile safebox.cpp
compile sectree.cpp
compile sectree_manager.cpp
compile sequence.cpp
compile shop.cpp
compile skill.cpp
compile start_position.cpp
compile target.cpp
compile text_file_loader.cpp
compile trigger.cpp
compile utils.cpp
compile vector.cpp
compile war_map.cpp
compile wedding.cpp
compile xmas_event.cpp
compile version.cpp
compile panama.cpp
compile threeway_war.cpp
compile map_location.cpp
compile auth_brazil.cpp
compile BlueDragon.cpp
compile BlueDragon_Binder.cpp
compile DragonLair.cpp
compile questlua_dragonlair.cpp
compile HackShield.cpp
compile HackShield_Impl.cpp
compile char_hackshield.cpp
compile skill_power.cpp
compile affect.cpp
compile SpeedServer.cpp
compile questlua_speedserver.cpp
compile XTrapManager.cpp
compile auction_manager.cpp
compile FileMonitor_FreeBSD.cpp
compile ClientPackageCryptInfo.cpp
compile cipher.cpp
../../../Extern/include/cryptopp/algparam.h: In constructor 'CryptoPP::ConstByteArrayParameter::ConstByteArrayParameter(const T&, bool) [with T = std::basic_string<char, std::char_traits<char>, std::allocator<char> >]':
../../../Extern/include/cryptopp/filters.h:793: instantiated from here
../../../Extern/include/cryptopp/algparam.h:26: warning: unused variable 'cryptopp_assert_26'
../../../Extern/include/cryptopp/algparam.h: In member function 'void CryptoPP::AlgorithmParametersTemplate<T>::MoveInto(void*) const [with T = CryptoPP::RandomNumberGenerator*]':
cipher.cpp:397: instantiated from here
../../../Extern/include/cryptopp/algparam.h:322: warning: unused variable 'p'
../../../Extern/include/cryptopp/misc.h: At global scope:
../../../Extern/include/cryptopp/misc.h:548: warning: 'std::string CryptoPP::StringNarrow(const wchar_t*, bool)' defined but not used
compile buff_on_attributes.cpp
compile check_server.cpp
compile dragon_soul_table.cpp
compile DragonSoul.cpp
DragonSoul.cpp: In member function 'bool DSManager::DoRefineGrade(CHARACTER*, TItemPos (&)[15])':
DragonSoul.cpp:556: error: 'prob_sum' was not declared in this scope
DragonSoul.cpp: In member function 'bool DSManager::DoRefineStep(CHARACTER*, TItemPos (&)[15])':
DragonSoul.cpp:765: warning: unused variable 'sum'
gmake: *** [OBJDIR/DragonSoul.o] Error 1
fi sigur ca dupa fiecare (void)nume ai pus " ; " ex (void)enum;
Închis
Răspunsuri
1
Vizualizări
323
Răspunsuri
8
Vizualizări
342
Răspunsuri
1
Vizualizări
245
Răspunsuri
8
Vizualizări
738

Înapoi la “Arhivă Probleme şi Întrebări”

  • Informaţie
  • Cine este conectat

    Utilizatori ce ce navighează pe acest forum: Google [Bot] și 17 vizitatori