Cod: Selectaţi tot
[OK] Config.cpp
[OK] NetBase.cpp
[OK] Peer.cpp
[OK] PeerBase.cpp
In file included from stdafx.h:14,
from Config.cpp:1:
../../common/tables.h:487: error: 'TITLE_MAX_LEN' was not declared in this scope
[OK] Main.cpp
[OK] Lock.cpp
In file included from stdafx.h:14,
from Peer.cpp:1:
../../common/tables.h:487: error: 'TITLE_MAX_LEN' was not declared in this scope
gmake: *** [.obj/Config.o] Error 1
gmake: *** Waiting for unfinished jobs....
In file included from stdafx.h:14,
from PeerBase.cpp:1:
../../common/tables.h:487: error: 'TITLE_MAX_LEN' was not declared in this scope
In file included from stdafx.h:14,
from NetBase.cpp:1:
../../common/tables.h:487: error: 'TITLE_MAX_LEN' was not declared in this scope
gmake: *** [.obj/Peer.o] Error 1
gmake: *** [.obj/PeerBase.o] Error 1
In file included from stdafx.h:14,
from Lock.cpp:1:
../../common/tables.h:487: error: 'TITLE_MAX_LEN' was not declared in this scope
gmake: *** [.obj/Lock.o] Error 1
In file included from stdafx.h:14,
from Main.cpp:1:
../../common/tables.h:487: error: 'TITLE_MAX_LEN' was not declared in this scope
gmake: *** [.obj/NetBase.o] Error 1
gmake: *** [.obj/Main.o] Error 1
*Resursa folosita:Sistem Titluri by Lent
*sysser:Nu este cazul .






