Salut ! am vrut sa compilez o sursa game,si la final dupa ce compileaza game imi da aceasta eroare
linking ../test
linking ../game_r40250_32....
/usr/bin/ld: cannot find -lcryptopp
/usr/bin/ld: cannot find -lcryptopp
gmake: *** [../test] Error 1
gmake: *** Waiting for unfinished jobs....
gmake: *** [../game_r40250_32] Error 1
Problema compilare sursa
- tutunaru
-

- Mesaje: 182
- Membru din: 23 Iun 2016, 12:17
- Server: Prodomo2
- Aprecieri: 476
- Mulţumiri: 70
- Discord: Copiază ID
- Contact:
- Hades ✔
-

- Mesaje: 3363
- Membru din: 22 Aug 2016, 18:35
- Server: Hades World
- Aprecieri: 104
- Mulţumiri: 824
- Discord: Copiază ID
- Contact:
cryptopp
Ti-am lasat sursa gata compilata fara protectie acolo.tutunaru scrie:Salut ! am vrut sa compilez o sursa game,si la final dupa ce compileaza game imi da aceasta eroare
linking ../test
linking ../game_r40250_32....
/usr/bin/ld: cannot find -lcryptopp
/usr/bin/ld: cannot find -lcryptopp
gmake: *** [../test] Error 1
gmake: *** Waiting for unfinished jobs....
gmake: *** [../game_r40250_32] Error 1
Uite si aici:
https://expirebox.com/download/9a6733bf ... c7b2d.html
-
- Informaţie
-
Cine este conectat
Utilizatori ce ce navighează pe acest forum: Niciun utilizator înregistrat și 53 vizitatori

daca te-am ajutat.
