Eroare complimare sursa hapiines

Totalitatea subiectelor care nu respectă regulamentul impus in sectiunea "Probleme şi Întrebări" vor fi stocate aici.
Avatar utilizator
D@rkN3Ss
Nivel 2

Nivel 2
Mesaje: 173
Membru din: 29 Mar 2015, 01:49
Regat: Shinsoo
Aprecieri: 14  
Mulţumiri: 0
Medalii

*Problemă:
Tipologie server(PvM / PvP):PVM
*Resursă folosită: *Link exclusiv J4M*
*ServerFiles utilizat:happines
*Syserr:
1>------ Build started: Project: scriptLib, Configuration: Distribute Win32 ------
2>------ Build started: Project: mileslib, Configuration: Distribute Win32 ------
3>------ Build started: Project: gamelib, Configuration: Distribute Win32 ------
1>Compiling...
2>Compiling...
4>------ Build started: Project: eterlib, Configuration: Distribute Win32 ------
3>Compiling...
4>Compiling...
2>SoundBase.cpp
1>StdAfx.cpp
3>StdAfx.cpp
4>StdAfx.cpp
1>e:\binary [source]\scriptlib\../eterLib/StdAfx.h(23) : fatal error C1083: Cannot open include file: 'd3d8.h': No such file or directory
4>e:\Binary [source]\EterLib\d3d8.h(134) : fatal error C1083: Cannot open include file: 'd3d8types.h': No such file or directory
4>Build log was saved at "file://e:\Binary [source]\EterLib\Distribute\BuildLog.htm"
4>eterlib - 1 error(s), 0 warning(s)
5>------ Build started: Project: eterPythonLib, Configuration: Distribute Win32 ------
5>Compiling...
2>e:\binary [source]\eterbase\lzo.h(5) : fatal error C1083: Cannot open include file: 'lzo-2.03/lzo1x.h': No such file or directory
2>Type.cpp
5>StdAfx.cpp
5>e:\binary [source]\eterpythonlib\../EterLib/StdAfx.h(23) : fatal error C1083: Cannot open include file: 'd3d8.h': No such file or directory
5>Build log was saved at "file://e:\Binary [source]\EterPythonLib\Distribute\BuildLog.htm"
5>eterPythonLib - 1 error(s), 0 warning(s)
3>e:\binary [source]\gamelib\../eterLib/StdAfx.h(23) : fatal error C1083: Cannot open include file: 'd3d8.h': No such file or directory
3>Build log was saved at "file://e:\Binary [source]\GameLib\Distribute\BuildLog.htm"
3>gamelib - 1 error(s), 0 warning(s)
6>------ Build started: Project: eterImageLib, Configuration: Distribute Win32 ------
6>Compiling...
6>DXTCImage.cpp
2>e:\binary [source]\eterbase\lzo.h(5) : fatal error C1083: Cannot open include file: 'lzo-2.03/lzo1x.h': No such file or directory
2>SoundManagerStream.cpp
6>e:\binary [source]\eterimagelib\StdAfx.h(33) : warning C4996: '_vsnprintf': This function or variable may be unsafe. Consider using _vsnprintf_s instead. To disable deprecation, use _CRT_SECURE_NO_WARNINGS. See online help for details.
6> C:\Program Files (x86)\Microsoft Visual Studio 9.0\VC\include\stdio.h(358) : see declaration of '_vsnprintf'
6>.\DXTCImage.cpp(4) : fatal error C1083: Cannot open include file: 'd3d.h': No such file or directory
6>TGAImage.cpp
2>e:\binary [source]\eterbase\lzo.h(5) : fatal error C1083: Cannot open include file: 'lzo-2.03/lzo1x.h': No such file or directory
2>SoundManager3D.cpp
7>------ Build started: Project: eterGrnLib, Configuration: Distribute Win32 ------
7>Compiling...
7>StdAfx.cpp
7>e:\binary [source]\etergrnlib\stdafx.h(6) : fatal error C1083: Cannot open include file: 'granny.h': No such file or directory
6>e:\binary [source]\eterimagelib\StdAfx.h(33) : warning C4996: '_vsnprintf': This function or variable may be unsafe. Consider using _vsnprintf_s instead. To disable deprecation, use _CRT_SECURE_NO_WARNINGS. See online help for details.
7>Build log was saved at "file://e:\Binary [source]\EterGrnLib\Distribute\BuildLog.htm"
6> C:\Program Files (x86)\Microsoft Visual Studio 9.0\VC\include\stdio.h(358) : see declaration of '_vsnprintf'
7>eterGrnLib - 1 error(s), 0 warning(s)
6>e:\binary [source]\eterbase\lzo.h(5) : fatal error C1083: Cannot open include file: 'lzo-2.03/lzo1x.h': No such file or directory
6>Generating Code...
6>Build log was saved at "file://e:\Binary [source]\EterImageLib\Distribute\BuildLog.htm"
6>eterImageLib - 2 error(s), 2 warning(s)
8>------ Build started: Project: eterBase, Configuration: Distribute Win32 ------
8>Compiling...
8>MappedFile.cpp
2>e:\binary [source]\eterbase\lzo.h(5) : fatal error C1083: Cannot open include file: 'lzo-2.03/lzo1x.h': No such file or directory
2>SoundManager2D.cpp
8>e:\binary [source]\eterbase\lzo.h(5) : fatal error C1083: Cannot open include file: 'lzo-2.03/lzo1x.h': No such file or directory
2>e:\binary [source]\eterbase\lzo.h(5) : fatal error C1083: Cannot open include file: 'lzo-2.03/lzo1x.h': No such file or directory
8>lzo.cpp
2>SoundManager.cpp
9>------ Build started: Project: EffectLib, Configuration: Distribute Win32 ------
9>Compiling...
9>StdAfx.cpp
2>e:\binary [source]\eterbase\lzo.h(5) : fatal error C1083: Cannot open include file: 'lzo-2.03/lzo1x.h': No such file or directory
2>SoundInstanceStream.cpp
8>.\lzo.cpp(3) : fatal error C1083: Cannot open include file: 'lzo-2.03/lzoLibLink.h': No such file or directory
8>cipher.cpp
2>e:\binary [source]\eterbase\lzo.h(5) : fatal error C1083: Cannot open include file: 'lzo-2.03/lzo1x.h': No such file or directory
2>SoundInstance3D.cpp
9>e:\Binary [source]\EffectLib\d3d8.h(134) : fatal error C1083: Cannot open include file: 'd3d8types.h': No such file or directory
8>e:\binary [source]\eterbase\cipher.h(8) : fatal error C1083: Cannot open include file: 'cryptopp/cryptlib.h': No such file or directory
9>Build log was saved at "file://e:\Binary [source]\EffectLib\Distribute\BuildLog.htm"
8>Generating Code...
9>EffectLib - 1 error(s), 0 warning(s)
8>Build log was saved at "file://e:\Binary [source]\EterBase\Distribute\BuildLog.htm"
8>eterBase - 3 error(s), 0 warning(s)
10>------ Build started: Project: SphereLib, Configuration: Distribute Win32 ------
10>Compiling...
10>StdAfx.cpp
11>------ Build started: Project: SpeedTreeLib, Configuration: Distribute Win32 ------
11>Compiling...
2>e:\binary [source]\eterbase\lzo.h(5) : fatal error C1083: Cannot open include file: 'lzo-2.03/lzo1x.h': No such file or directory
2>SoundInstance2D.cpp
11>StdAfx.cpp
11>e:\binary [source]\speedtreelib\SpeedTreeForest.h(35) : fatal error C1083: Cannot open include file: 'SpeedTreeRT.h': No such file or directory
10>e:\Binary [source]\SphereLib\d3d8.h(135) : fatal error C1083: Cannot open include file: 'd3d8caps.h': No such file or directory
11>Build log was saved at "file://e:\Binary [source]\SpeedTreeLib\Distribute\BuildLog.htm"
10>Build log was saved at "file://e:\Binary [source]\SphereLib\Distribute\BuildLog.htm"
10>SphereLib - 1 error(s), 0 warning(s)
11>SpeedTreeLib - 1 error(s), 0 warning(s)
12>------ Build started: Project: PRTerrainLib, Configuration: Distribute Win32 ------
13>------ Build started: Project: EterPack, Configuration: Distribute Win32 ------
12>Compiling...
13>Compiling...
13>EterPackPolicy_CSHybridCrypt.cpp
12>StdAfx.cpp
2>e:\binary [source]\eterbase\lzo.h(5) : fatal error C1083: Cannot open include file: 'lzo-2.03/lzo1x.h': No such file or directory
2>SoundData.cpp
12>e:\Binary [source]\PRTerrainLib\d3d8.h(134) : fatal error C1083: Cannot open include file: 'd3d8types.h': No such file or directory
13>e:\binary [source]\eterbase\filename.h(236) : warning C4996: 'strcpy': This function or variable may be unsafe. Consider using strcpy_s instead. To disable deprecation, use _CRT_SECURE_NO_WARNINGS. See online help for details.
13> C:\Program Files (x86)\Microsoft Visual Studio 9.0\VC\include\string.h(74) : see declaration of 'strcpy'
13>e:\binary [source]\eterpack\EterPackPolicy_CSHybridCrypt.h(4) : fatal error C1083: Cannot open include file: 'boost/unordered_map.hpp': No such file or directory
13>EterPackManager.cpp
2>e:\binary [source]\eterbase\lzo.h(5) : fatal error C1083: Cannot open include file: 'lzo-2.03/lzo1x.h': No such file or directory
2>Generating Code...
1>Build log was saved at "file://e:\Binary [source]\ScriptLib\Distribute\BuildLog.htm"
1>scriptLib - 1 error(s), 0 warning(s)
2>Build log was saved at "file://e:\Binary [source]\milesLib\Distribute\BuildLog.htm"
2>mileslib - 10 error(s), 0 warning(s)
13>e:\binary [source]\eterbase\filename.h(236) : warning C4996: 'strcpy': This function or variable may be unsafe. Consider using strcpy_s instead. To disable deprecation, use _CRT_SECURE_NO_WARNINGS. See online help for details.
13> C:\Program Files (x86)\Microsoft Visual Studio 9.0\VC\include\string.h(74) : see declaration of 'strcpy'
13>e:\binary [source]\eterpack\EterPackManager.h(4) : fatal error C1083: Cannot open include file: 'boost/unordered_map.hpp': No such file or directory
13>EterPackCursor.cpp
13>e:\binary [source]\eterbase\filename.h(236) : warning C4996: 'strcpy': This function or variable may be unsafe. Consider using strcpy_s instead. To disable deprecation, use _CRT_SECURE_NO_WARNINGS. See online help for details.
13> C:\Program Files (x86)\Microsoft Visual Studio 9.0\VC\include\string.h(74) : see declaration of 'strcpy'
12>Build log was saved at "file://e:\Binary [source]\PRTerrainLib\Distribute\BuildLog.htm"
12>PRTerrainLib - 1 error(s), 0 warning(s)
13>e:\binary [source]\eterpack\EterPack.h(5) : fatal error C1083: Cannot open include file: 'boost/unordered_map.hpp': No such file or directory
13>Generating Code...
13>Build log was saved at "file://e:\Binary [source]\EterPack\Distribute\BuildLog.htm"
13>EterPack - 3 error(s), 3 warning(s)
14>------ Build started: Project: UserInterface, Configuration: Distribute Win32 ------
14>Compiling...
14>StdAfx.cpp
14>e:\binary [source]\userinterface\../eterLib/StdAfx.h(23) : fatal error C1083: Cannot open include file: 'd3d8.h': No such file or directory
14>Build log was saved at "file://e:\Binary [source]\UserInterface\Distribute\BuildLog.htm"
14>UserInterface - 1 error(s), 0 warning(s)
========== Build: 0 succeeded, 14 failed, 2 up-to-date, 0 skipped ==========
Poză:
*Detalii suplimentare: salutare ,primesc aceasta eroare la complimare . a, adaugat fiserele care spun ca sutn lipsa . dar tot imi da aceste erori
Avatar utilizator
Bughy
Ţepar / Untrusted User

Ţepar / Untrusted User
Mesaje: 431
Membru din: 10 Apr 2018, 22:33
Server: Toate =))
Regat: Jinno
Aprecieri: 62  
Mulţumiri: 51  
 Contact:
Medalii

ai adaugat liburile?
Imagine
Daca te-am ajutat lasa un like :) B-) :ymhug: ;)
Afișează semnătura
Avatar utilizator
D@rkN3Ss
Nivel 2

Nivel 2
Mesaje: 173
Membru din: 29 Mar 2015, 01:49
Regat: Shinsoo
Aprecieri: 14  
Mulţumiri: 0
Medalii

Salut da, de exemplu la d3d8, l-am adaugat in userinterface, dar tot primesc eroarea asa e la fiecare ..
Avatar utilizator
AndyOpris
Nivel 4

Nivel 4
Mesaje: 500
Membru din: 09 Iun 2015, 15:12
Server: -
Regat: Jinno
Aprecieri: 1  
Mulţumiri: 226  
Medalii

Nu ai externul bun
Avatar utilizator
D@rkN3Ss
Nivel 2

Nivel 2
Mesaje: 173
Membru din: 29 Mar 2015, 01:49
Regat: Shinsoo
Aprecieri: 14  
Mulţumiri: 0
Medalii

Pai faza e ca nu am gasit fiserele alea pe net de la sursa happines, si am luat acele fisere de la sursa gazern, dar vad ca nu merge ..
Avatar utilizator
Bughy
Ţepar / Untrusted User

Ţepar / Untrusted User
Mesaje: 431
Membru din: 10 Apr 2018, 22:33
Server: Toate =))
Regat: Jinno
Aprecieri: 62  
Mulţumiri: 51  
 Contact:
Medalii

Pai uita-te daca ai liburile in locatiile corecte. Cum e asta:

11>e:\binary [source]\speedtreelib\SpeedTreeForest.h(35) : fatal error C1083: Cannot open include file: 'SpeedTreeRT.h': No such file or directory

Uita-te in folderul speedtreelib daca si SpeedTreeR.h
Imagine
Daca te-am ajutat lasa un like :) B-) :ymhug: ;)
Afișează semnătura
Avatar utilizator
Moț
Ţepar / Untrusted User

Ţepar / Untrusted User
Mesaje: 2825
Membru din: 03 Apr 2017, 15:00
Aprecieri: 216  
Mulţumiri: 3040  
Discord: Copiază ID
Medalii

D@rkN3Ss scrie:*Problemă:
Tipologie server(PvM / PvP):PVM
*Resursă folosită: *Link exclusiv J4M*
*ServerFiles utilizat:happines
*Syserr:
1>------ Build started: Project: scriptLib, Configuration: Distribute Win32 ------
2>------ Build started: Project: mileslib, Configuration: Distribute Win32 ------
3>------ Build started: Project: gamelib, Configuration: Distribute Win32 ------
1>Compiling...
2>Compiling...
4>------ Build started: Project: eterlib, Configuration: Distribute Win32 ------
3>Compiling...
4>Compiling...
2>SoundBase.cpp
1>StdAfx.cpp
3>StdAfx.cpp
4>StdAfx.cpp
1>e:\binary [source]\scriptlib\../eterLib/StdAfx.h(23) : fatal error C1083: Cannot open include file: 'd3d8.h': No such file or directory
4>e:\Binary [source]\EterLib\d3d8.h(134) : fatal error C1083: Cannot open include file: 'd3d8types.h': No such file or directory
4>Build log was saved at "file://e:\Binary [source]\EterLib\Distribute\BuildLog.htm"
4>eterlib - 1 error(s), 0 warning(s)
5>------ Build started: Project: eterPythonLib, Configuration: Distribute Win32 ------
5>Compiling...
2>e:\binary [source]\eterbase\lzo.h(5) : fatal error C1083: Cannot open include file: 'lzo-2.03/lzo1x.h': No such file or directory
2>Type.cpp
5>StdAfx.cpp
5>e:\binary [source]\eterpythonlib\../EterLib/StdAfx.h(23) : fatal error C1083: Cannot open include file: 'd3d8.h': No such file or directory
5>Build log was saved at "file://e:\Binary [source]\EterPythonLib\Distribute\BuildLog.htm"
5>eterPythonLib - 1 error(s), 0 warning(s)
3>e:\binary [source]\gamelib\../eterLib/StdAfx.h(23) : fatal error C1083: Cannot open include file: 'd3d8.h': No such file or directory
3>Build log was saved at "file://e:\Binary [source]\GameLib\Distribute\BuildLog.htm"
3>gamelib - 1 error(s), 0 warning(s)
6>------ Build started: Project: eterImageLib, Configuration: Distribute Win32 ------
6>Compiling...
6>DXTCImage.cpp
2>e:\binary [source]\eterbase\lzo.h(5) : fatal error C1083: Cannot open include file: 'lzo-2.03/lzo1x.h': No such file or directory
2>SoundManagerStream.cpp
6>e:\binary [source]\eterimagelib\StdAfx.h(33) : warning C4996: '_vsnprintf': This function or variable may be unsafe. Consider using _vsnprintf_s instead. To disable deprecation, use _CRT_SECURE_NO_WARNINGS. See online help for details.
6> C:\Program Files (x86)\Microsoft Visual Studio 9.0\VC\include\stdio.h(358) : see declaration of '_vsnprintf'
6>.\DXTCImage.cpp(4) : fatal error C1083: Cannot open include file: 'd3d.h': No such file or directory
6>TGAImage.cpp
2>e:\binary [source]\eterbase\lzo.h(5) : fatal error C1083: Cannot open include file: 'lzo-2.03/lzo1x.h': No such file or directory
2>SoundManager3D.cpp
7>------ Build started: Project: eterGrnLib, Configuration: Distribute Win32 ------
7>Compiling...
7>StdAfx.cpp
7>e:\binary [source]\etergrnlib\stdafx.h(6) : fatal error C1083: Cannot open include file: 'granny.h': No such file or directory
6>e:\binary [source]\eterimagelib\StdAfx.h(33) : warning C4996: '_vsnprintf': This function or variable may be unsafe. Consider using _vsnprintf_s instead. To disable deprecation, use _CRT_SECURE_NO_WARNINGS. See online help for details.
7>Build log was saved at "file://e:\Binary [source]\EterGrnLib\Distribute\BuildLog.htm"
6> C:\Program Files (x86)\Microsoft Visual Studio 9.0\VC\include\stdio.h(358) : see declaration of '_vsnprintf'
7>eterGrnLib - 1 error(s), 0 warning(s)
6>e:\binary [source]\eterbase\lzo.h(5) : fatal error C1083: Cannot open include file: 'lzo-2.03/lzo1x.h': No such file or directory
6>Generating Code...
6>Build log was saved at "file://e:\Binary [source]\EterImageLib\Distribute\BuildLog.htm"
6>eterImageLib - 2 error(s), 2 warning(s)
8>------ Build started: Project: eterBase, Configuration: Distribute Win32 ------
8>Compiling...
8>MappedFile.cpp
2>e:\binary [source]\eterbase\lzo.h(5) : fatal error C1083: Cannot open include file: 'lzo-2.03/lzo1x.h': No such file or directory
2>SoundManager2D.cpp
8>e:\binary [source]\eterbase\lzo.h(5) : fatal error C1083: Cannot open include file: 'lzo-2.03/lzo1x.h': No such file or directory
2>e:\binary [source]\eterbase\lzo.h(5) : fatal error C1083: Cannot open include file: 'lzo-2.03/lzo1x.h': No such file or directory
8>lzo.cpp
2>SoundManager.cpp
9>------ Build started: Project: EffectLib, Configuration: Distribute Win32 ------
9>Compiling...
9>StdAfx.cpp
2>e:\binary [source]\eterbase\lzo.h(5) : fatal error C1083: Cannot open include file: 'lzo-2.03/lzo1x.h': No such file or directory
2>SoundInstanceStream.cpp
8>.\lzo.cpp(3) : fatal error C1083: Cannot open include file: 'lzo-2.03/lzoLibLink.h': No such file or directory
8>cipher.cpp
2>e:\binary [source]\eterbase\lzo.h(5) : fatal error C1083: Cannot open include file: 'lzo-2.03/lzo1x.h': No such file or directory
2>SoundInstance3D.cpp
9>e:\Binary [source]\EffectLib\d3d8.h(134) : fatal error C1083: Cannot open include file: 'd3d8types.h': No such file or directory
8>e:\binary [source]\eterbase\cipher.h(8) : fatal error C1083: Cannot open include file: 'cryptopp/cryptlib.h': No such file or directory
9>Build log was saved at "file://e:\Binary [source]\EffectLib\Distribute\BuildLog.htm"
8>Generating Code...
9>EffectLib - 1 error(s), 0 warning(s)
8>Build log was saved at "file://e:\Binary [source]\EterBase\Distribute\BuildLog.htm"
8>eterBase - 3 error(s), 0 warning(s)
10>------ Build started: Project: SphereLib, Configuration: Distribute Win32 ------
10>Compiling...
10>StdAfx.cpp
11>------ Build started: Project: SpeedTreeLib, Configuration: Distribute Win32 ------
11>Compiling...
2>e:\binary [source]\eterbase\lzo.h(5) : fatal error C1083: Cannot open include file: 'lzo-2.03/lzo1x.h': No such file or directory
2>SoundInstance2D.cpp
11>StdAfx.cpp
11>e:\binary [source]\speedtreelib\SpeedTreeForest.h(35) : fatal error C1083: Cannot open include file: 'SpeedTreeRT.h': No such file or directory
10>e:\Binary [source]\SphereLib\d3d8.h(135) : fatal error C1083: Cannot open include file: 'd3d8caps.h': No such file or directory
11>Build log was saved at "file://e:\Binary [source]\SpeedTreeLib\Distribute\BuildLog.htm"
10>Build log was saved at "file://e:\Binary [source]\SphereLib\Distribute\BuildLog.htm"
10>SphereLib - 1 error(s), 0 warning(s)
11>SpeedTreeLib - 1 error(s), 0 warning(s)
12>------ Build started: Project: PRTerrainLib, Configuration: Distribute Win32 ------
13>------ Build started: Project: EterPack, Configuration: Distribute Win32 ------
12>Compiling...
13>Compiling...
13>EterPackPolicy_CSHybridCrypt.cpp
12>StdAfx.cpp
2>e:\binary [source]\eterbase\lzo.h(5) : fatal error C1083: Cannot open include file: 'lzo-2.03/lzo1x.h': No such file or directory
2>SoundData.cpp
12>e:\Binary [source]\PRTerrainLib\d3d8.h(134) : fatal error C1083: Cannot open include file: 'd3d8types.h': No such file or directory
13>e:\binary [source]\eterbase\filename.h(236) : warning C4996: 'strcpy': This function or variable may be unsafe. Consider using strcpy_s instead. To disable deprecation, use _CRT_SECURE_NO_WARNINGS. See online help for details.
13> C:\Program Files (x86)\Microsoft Visual Studio 9.0\VC\include\string.h(74) : see declaration of 'strcpy'
13>e:\binary [source]\eterpack\EterPackPolicy_CSHybridCrypt.h(4) : fatal error C1083: Cannot open include file: 'boost/unordered_map.hpp': No such file or directory
13>EterPackManager.cpp
2>e:\binary [source]\eterbase\lzo.h(5) : fatal error C1083: Cannot open include file: 'lzo-2.03/lzo1x.h': No such file or directory
2>Generating Code...
1>Build log was saved at "file://e:\Binary [source]\ScriptLib\Distribute\BuildLog.htm"
1>scriptLib - 1 error(s), 0 warning(s)
2>Build log was saved at "file://e:\Binary [source]\milesLib\Distribute\BuildLog.htm"
2>mileslib - 10 error(s), 0 warning(s)
13>e:\binary [source]\eterbase\filename.h(236) : warning C4996: 'strcpy': This function or variable may be unsafe. Consider using strcpy_s instead. To disable deprecation, use _CRT_SECURE_NO_WARNINGS. See online help for details.
13> C:\Program Files (x86)\Microsoft Visual Studio 9.0\VC\include\string.h(74) : see declaration of 'strcpy'
13>e:\binary [source]\eterpack\EterPackManager.h(4) : fatal error C1083: Cannot open include file: 'boost/unordered_map.hpp': No such file or directory
13>EterPackCursor.cpp
13>e:\binary [source]\eterbase\filename.h(236) : warning C4996: 'strcpy': This function or variable may be unsafe. Consider using strcpy_s instead. To disable deprecation, use _CRT_SECURE_NO_WARNINGS. See online help for details.
13> C:\Program Files (x86)\Microsoft Visual Studio 9.0\VC\include\string.h(74) : see declaration of 'strcpy'
12>Build log was saved at "file://e:\Binary [source]\PRTerrainLib\Distribute\BuildLog.htm"
12>PRTerrainLib - 1 error(s), 0 warning(s)
13>e:\binary [source]\eterpack\EterPack.h(5) : fatal error C1083: Cannot open include file: 'boost/unordered_map.hpp': No such file or directory
13>Generating Code...
13>Build log was saved at "file://e:\Binary [source]\EterPack\Distribute\BuildLog.htm"
13>EterPack - 3 error(s), 3 warning(s)
14>------ Build started: Project: UserInterface, Configuration: Distribute Win32 ------
14>Compiling...
14>StdAfx.cpp
14>e:\binary [source]\userinterface\../eterLib/StdAfx.h(23) : fatal error C1083: Cannot open include file: 'd3d8.h': No such file or directory
14>Build log was saved at "file://e:\Binary [source]\UserInterface\Distribute\BuildLog.htm"
14>UserInterface - 1 error(s), 0 warning(s)
========== Build: 0 succeeded, 14 failed, 2 up-to-date, 0 skipped ==========
Poză:
*Detalii suplimentare: salutare ,primesc aceasta eroare la complimare . a, adaugat fiserele care spun ca sutn lipsa . dar tot imi da aceste erori
Pentru acest mesaj, Moț for the post:
D@rkN3Ss
Imagine
Afișează semnătura
Avatar utilizator
D@rkN3Ss
Nivel 2

Nivel 2
Mesaje: 173
Membru din: 29 Mar 2015, 01:49
Regat: Shinsoo
Aprecieri: 14  
Mulţumiri: 0
Medalii

Gato scrie:
D@rkN3Ss scrie:*Problemă:
Tipologie server(PvM / PvP):PVM
*Resursă folosită: *Link exclusiv J4M*
*ServerFiles utilizat:happines
*Syserr:
1>------ Build started: Project: scriptLib, Configuration: Distribute Win32 ------
2>------ Build started: Project: mileslib, Configuration: Distribute Win32 ------
3>------ Build started: Project: gamelib, Configuration: Distribute Win32 ------
1>Compiling...
2>Compiling...
4>------ Build started: Project: eterlib, Configuration: Distribute Win32 ------
3>Compiling...
4>Compiling...
2>SoundBase.cpp
1>StdAfx.cpp
3>StdAfx.cpp
4>StdAfx.cpp
1>e:\binary [source]\scriptlib\../eterLib/StdAfx.h(23) : fatal error C1083: Cannot open include file: 'd3d8.h': No such file or directory
4>e:\Binary [source]\EterLib\d3d8.h(134) : fatal error C1083: Cannot open include file: 'd3d8types.h': No such file or directory
4>Build log was saved at "file://e:\Binary [source]\EterLib\Distribute\BuildLog.htm"
4>eterlib - 1 error(s), 0 warning(s)
5>------ Build started: Project: eterPythonLib, Configuration: Distribute Win32 ------
5>Compiling...
2>e:\binary [source]\eterbase\lzo.h(5) : fatal error C1083: Cannot open include file: 'lzo-2.03/lzo1x.h': No such file or directory
2>Type.cpp
5>StdAfx.cpp
5>e:\binary [source]\eterpythonlib\../EterLib/StdAfx.h(23) : fatal error C1083: Cannot open include file: 'd3d8.h': No such file or directory
5>Build log was saved at "file://e:\Binary [source]\EterPythonLib\Distribute\BuildLog.htm"
5>eterPythonLib - 1 error(s), 0 warning(s)
3>e:\binary [source]\gamelib\../eterLib/StdAfx.h(23) : fatal error C1083: Cannot open include file: 'd3d8.h': No such file or directory
3>Build log was saved at "file://e:\Binary [source]\GameLib\Distribute\BuildLog.htm"
3>gamelib - 1 error(s), 0 warning(s)
6>------ Build started: Project: eterImageLib, Configuration: Distribute Win32 ------
6>Compiling...
6>DXTCImage.cpp
2>e:\binary [source]\eterbase\lzo.h(5) : fatal error C1083: Cannot open include file: 'lzo-2.03/lzo1x.h': No such file or directory
2>SoundManagerStream.cpp
6>e:\binary [source]\eterimagelib\StdAfx.h(33) : warning C4996: '_vsnprintf': This function or variable may be unsafe. Consider using _vsnprintf_s instead. To disable deprecation, use _CRT_SECURE_NO_WARNINGS. See online help for details.
6> C:\Program Files (x86)\Microsoft Visual Studio 9.0\VC\include\stdio.h(358) : see declaration of '_vsnprintf'
6>.\DXTCImage.cpp(4) : fatal error C1083: Cannot open include file: 'd3d.h': No such file or directory
6>TGAImage.cpp
2>e:\binary [source]\eterbase\lzo.h(5) : fatal error C1083: Cannot open include file: 'lzo-2.03/lzo1x.h': No such file or directory
2>SoundManager3D.cpp
7>------ Build started: Project: eterGrnLib, Configuration: Distribute Win32 ------
7>Compiling...
7>StdAfx.cpp
7>e:\binary [source]\etergrnlib\stdafx.h(6) : fatal error C1083: Cannot open include file: 'granny.h': No such file or directory
6>e:\binary [source]\eterimagelib\StdAfx.h(33) : warning C4996: '_vsnprintf': This function or variable may be unsafe. Consider using _vsnprintf_s instead. To disable deprecation, use _CRT_SECURE_NO_WARNINGS. See online help for details.
7>Build log was saved at "file://e:\Binary [source]\EterGrnLib\Distribute\BuildLog.htm"
6> C:\Program Files (x86)\Microsoft Visual Studio 9.0\VC\include\stdio.h(358) : see declaration of '_vsnprintf'
7>eterGrnLib - 1 error(s), 0 warning(s)
6>e:\binary [source]\eterbase\lzo.h(5) : fatal error C1083: Cannot open include file: 'lzo-2.03/lzo1x.h': No such file or directory
6>Generating Code...
6>Build log was saved at "file://e:\Binary [source]\EterImageLib\Distribute\BuildLog.htm"
6>eterImageLib - 2 error(s), 2 warning(s)
8>------ Build started: Project: eterBase, Configuration: Distribute Win32 ------
8>Compiling...
8>MappedFile.cpp
2>e:\binary [source]\eterbase\lzo.h(5) : fatal error C1083: Cannot open include file: 'lzo-2.03/lzo1x.h': No such file or directory
2>SoundManager2D.cpp
8>e:\binary [source]\eterbase\lzo.h(5) : fatal error C1083: Cannot open include file: 'lzo-2.03/lzo1x.h': No such file or directory
2>e:\binary [source]\eterbase\lzo.h(5) : fatal error C1083: Cannot open include file: 'lzo-2.03/lzo1x.h': No such file or directory
8>lzo.cpp
2>SoundManager.cpp
9>------ Build started: Project: EffectLib, Configuration: Distribute Win32 ------
9>Compiling...
9>StdAfx.cpp
2>e:\binary [source]\eterbase\lzo.h(5) : fatal error C1083: Cannot open include file: 'lzo-2.03/lzo1x.h': No such file or directory
2>SoundInstanceStream.cpp
8>.\lzo.cpp(3) : fatal error C1083: Cannot open include file: 'lzo-2.03/lzoLibLink.h': No such file or directory
8>cipher.cpp
2>e:\binary [source]\eterbase\lzo.h(5) : fatal error C1083: Cannot open include file: 'lzo-2.03/lzo1x.h': No such file or directory
2>SoundInstance3D.cpp
9>e:\Binary [source]\EffectLib\d3d8.h(134) : fatal error C1083: Cannot open include file: 'd3d8types.h': No such file or directory
8>e:\binary [source]\eterbase\cipher.h(8) : fatal error C1083: Cannot open include file: 'cryptopp/cryptlib.h': No such file or directory
9>Build log was saved at "file://e:\Binary [source]\EffectLib\Distribute\BuildLog.htm"
8>Generating Code...
9>EffectLib - 1 error(s), 0 warning(s)
8>Build log was saved at "file://e:\Binary [source]\EterBase\Distribute\BuildLog.htm"
8>eterBase - 3 error(s), 0 warning(s)
10>------ Build started: Project: SphereLib, Configuration: Distribute Win32 ------
10>Compiling...
10>StdAfx.cpp
11>------ Build started: Project: SpeedTreeLib, Configuration: Distribute Win32 ------
11>Compiling...
2>e:\binary [source]\eterbase\lzo.h(5) : fatal error C1083: Cannot open include file: 'lzo-2.03/lzo1x.h': No such file or directory
2>SoundInstance2D.cpp
11>StdAfx.cpp
11>e:\binary [source]\speedtreelib\SpeedTreeForest.h(35) : fatal error C1083: Cannot open include file: 'SpeedTreeRT.h': No such file or directory
10>e:\Binary [source]\SphereLib\d3d8.h(135) : fatal error C1083: Cannot open include file: 'd3d8caps.h': No such file or directory
11>Build log was saved at "file://e:\Binary [source]\SpeedTreeLib\Distribute\BuildLog.htm"
10>Build log was saved at "file://e:\Binary [source]\SphereLib\Distribute\BuildLog.htm"
10>SphereLib - 1 error(s), 0 warning(s)
11>SpeedTreeLib - 1 error(s), 0 warning(s)
12>------ Build started: Project: PRTerrainLib, Configuration: Distribute Win32 ------
13>------ Build started: Project: EterPack, Configuration: Distribute Win32 ------
12>Compiling...
13>Compiling...
13>EterPackPolicy_CSHybridCrypt.cpp
12>StdAfx.cpp
2>e:\binary [source]\eterbase\lzo.h(5) : fatal error C1083: Cannot open include file: 'lzo-2.03/lzo1x.h': No such file or directory
2>SoundData.cpp
12>e:\Binary [source]\PRTerrainLib\d3d8.h(134) : fatal error C1083: Cannot open include file: 'd3d8types.h': No such file or directory
13>e:\binary [source]\eterbase\filename.h(236) : warning C4996: 'strcpy': This function or variable may be unsafe. Consider using strcpy_s instead. To disable deprecation, use _CRT_SECURE_NO_WARNINGS. See online help for details.
13> C:\Program Files (x86)\Microsoft Visual Studio 9.0\VC\include\string.h(74) : see declaration of 'strcpy'
13>e:\binary [source]\eterpack\EterPackPolicy_CSHybridCrypt.h(4) : fatal error C1083: Cannot open include file: 'boost/unordered_map.hpp': No such file or directory
13>EterPackManager.cpp
2>e:\binary [source]\eterbase\lzo.h(5) : fatal error C1083: Cannot open include file: 'lzo-2.03/lzo1x.h': No such file or directory
2>Generating Code...
1>Build log was saved at "file://e:\Binary [source]\ScriptLib\Distribute\BuildLog.htm"
1>scriptLib - 1 error(s), 0 warning(s)
2>Build log was saved at "file://e:\Binary [source]\milesLib\Distribute\BuildLog.htm"
2>mileslib - 10 error(s), 0 warning(s)
13>e:\binary [source]\eterbase\filename.h(236) : warning C4996: 'strcpy': This function or variable may be unsafe. Consider using strcpy_s instead. To disable deprecation, use _CRT_SECURE_NO_WARNINGS. See online help for details.
13> C:\Program Files (x86)\Microsoft Visual Studio 9.0\VC\include\string.h(74) : see declaration of 'strcpy'
13>e:\binary [source]\eterpack\EterPackManager.h(4) : fatal error C1083: Cannot open include file: 'boost/unordered_map.hpp': No such file or directory
13>EterPackCursor.cpp
13>e:\binary [source]\eterbase\filename.h(236) : warning C4996: 'strcpy': This function or variable may be unsafe. Consider using strcpy_s instead. To disable deprecation, use _CRT_SECURE_NO_WARNINGS. See online help for details.
13> C:\Program Files (x86)\Microsoft Visual Studio 9.0\VC\include\string.h(74) : see declaration of 'strcpy'
12>Build log was saved at "file://e:\Binary [source]\PRTerrainLib\Distribute\BuildLog.htm"
12>PRTerrainLib - 1 error(s), 0 warning(s)
13>e:\binary [source]\eterpack\EterPack.h(5) : fatal error C1083: Cannot open include file: 'boost/unordered_map.hpp': No such file or directory
13>Generating Code...
13>Build log was saved at "file://e:\Binary [source]\EterPack\Distribute\BuildLog.htm"
13>EterPack - 3 error(s), 3 warning(s)
14>------ Build started: Project: UserInterface, Configuration: Distribute Win32 ------
14>Compiling...
14>StdAfx.cpp
14>e:\binary [source]\userinterface\../eterLib/StdAfx.h(23) : fatal error C1083: Cannot open include file: 'd3d8.h': No such file or directory
14>Build log was saved at "file://e:\Binary [source]\UserInterface\Distribute\BuildLog.htm"
14>UserInterface - 1 error(s), 0 warning(s)
========== Build: 0 succeeded, 14 failed, 2 up-to-date, 0 skipped ==========
Poză:
*Detalii suplimentare: salutare ,primesc aceasta eroare la complimare . a, adaugat fiserele care spun ca sutn lipsa . dar tot imi da aceste erori
Salut, a mers complimata, dar nu imi intra in client 0418 22:34:36351 :: LZObject: key incorrect
0418 22:34:36352 :: LZObject: key incorrect
0418 22:34:36399 :: LZObject: key incorrect
0418 22:34:36413 :: LZObject: key incorrect
0418 22:34:36418 :: LZObject: key incorrect
0418 22:34:36419 :: LZObject: key incorrect
0418 22:34:36420 :: LZObject: key incorrect
0418 22:34:00007 :: CANNOT_FIND_PACK_FILE [locale/ro/atlasinfo.txt]
0418 22:34:00033 :: RunMain Error
0418 22:34:00035 :: granny_shared_vbs:
0418 22:34:00035 :: 0: 0
0418 22:34:00035 :: 1: 0
0418 22:34:00035 :: 2: 0
0418 22:34:00035 :: 3: 0
0418 22:34:00036 :: 4: 0
0418 22:34:00036 :: 5: 0
0418 22:34:00036 :: 6: 0
0418 22:34:00036 :: 7: 0
0418 22:34:00036 :: 8: 0
Avatar utilizator
Yuris
Nivel 2

Nivel 2
Mesaje: 260
Membru din: 27 Iul 2017, 11:30
Aprecieri: 30  
Mulţumiri: 411  
Medalii

In sursa aveai alt LZO, iar clientul este impachetat cu alt LZO.
Afișează semnătura
Avatar utilizator
D@rkN3Ss
Nivel 2

Nivel 2
Mesaje: 173
Membru din: 29 Mar 2015, 01:49
Regat: Shinsoo
Aprecieri: 14  
Mulţumiri: 0
Medalii

Salut, Yuri

Si ce e de facut ? ce ar trebui sa fac ca sa mearga noul exe ?
Închis
Răspunsuri
1
Vizualizări
430
Răspunsuri
10
Vizualizări
804
Răspunsuri
4
Vizualizări
341

Înapoi la “Arhivă Probleme şi Întrebări”

  • Informaţie
  • Cine este conectat

    Utilizatori ce ce navighează pe acest forum: Baidu [Spider], Bing [Bot] și 16 vizitatori