*Problemă: Am adaugat ce trebuie pentru sistem in sursa game si imi da eroare Tipologie server: PvM *Resursă folosită: - *ServerFiles utilizat: - *Syserr: in poza Poză:
aici spune ca e eroarea : *Detalii suplimentare: A mai dat o eroare pe care o rezolvasem, iar acu da asta
Am adaugat cele 2 fisiere cu biolog si acum imi da eroarea :
ABBC3_SPOILER_SHOW
biolog.cpp:16:27: error: biologDefines.h: No such file or directory
compile offline_shop.cpp
biolog.cpp:30: error: 'AFF_BIO_17' was not declared in this scope
biolog.cpp:30: error: 'AFF_BIO_18' was not declared in this scope
biolog.cpp:30: error: 'AFF_BIO_19' was not declared in this scope
biolog.cpp:30: error: 'AFF_BIO_20' was not declared in this scope
biolog.cpp: In function 'void SendMessage(CHARACTER*, const char*)':
biolog.cpp:56: error: 'pTable_Translate' was not declared in this scope
biolog.cpp:59: error: 'pTable_Translate' was not declared in this scope
biolog.cpp:62: error: 'pTable_Translate' was not declared in this scope
biolog.cpp: In member function 'void BiologManager::SendBonusType(CHARACTER*, int)':
biolog.cpp:76: error: 'pPopUp' was not declared in this scope
biolog.cpp:76: error: 'pTableRewardItem' was not declared in this scope
biolog.cpp:76: error: 'tableBonus' was not declared in this scope
biolog.cpp:76: error: 'SendMessagePopUp' was not declared in this scope
biolog.cpp:78: error: 'unlimited' was not declared in this scope
biolog.cpp: In member function 'void BiologManager::SelectBonusType(CHARACTER*, const char* )':
biolog.cpp:133: error: 'pTableRewardItem' was not declared in this scope
biolog.cpp:134: error: 'tableBonus' was not declared in this scope
biolog.cpp:134: error: 'unlimited' was not declared in this scope
biolog.cpp:135: error: 'pPopUp' was not declared in this scope
biolog.cpp:135: error: 'SendMessagePopUp' was not declared in this scope
biolog.cpp:138: error: 'pTableRewardItem' was not declared in this scope
biolog.cpp:139: error: 'tableBonus' was not declared in this scope
biolog.cpp:139: error: 'unlimited' was not declared in this scope
biolog.cpp:140: error: 'pPopUp' was not declared in this scope
biolog.cpp:140: error: 'SendMessagePopUp' was not declared in this scope
biolog.cpp:143: error: 'pTableRewardItem' was not declared in this scope
biolog.cpp:144: error: 'tableBonus' was not declared in this scope
biolog.cpp:144: error: 'unlimited' was not declared in this scope
biolog.cpp:145: error: 'pPopUp' was not declared in this scope
biolog.cpp:145: error: 'SendMessagePopUp' was not declared in this scope
biolog.cpp:153: error: 'pTableRewardItem' was not declared in this scope
biolog.cpp:154: error: 'tableBonus' was not declared in this scope
biolog.cpp:154: error: 'unlimited' was not declared in this scope
biolog.cpp:155: error: 'pPopUp' was not declared in this scope
biolog.cpp:155: error: 'SendMessagePopUp' was not declared in this scope
biolog.cpp:158: error: 'pTableRewardItem' was not declared in this scope
biolog.cpp:159: error: 'tableBonus' was not declared in this scope
biolog.cpp:159: error: 'unlimited' was not declared in this scope
biolog.cpp:160: error: 'pPopUp' was not declared in this scope
biolog.cpp:160: error: 'SendMessagePopUp' was not declared in this scope
biolog.cpp: In member function 'void BiologManager::SendWindow_SelectType(CHARACTER*, int)' :
biolog.cpp:176: error: 'pPopUp' was not declared in this scope
biolog.cpp:182: error: 'tableBonus' was not declared in this scope
biolog.cpp:189: error: 'pPopUp' was not declared in this scope
biolog.cpp:193: error: 'tableBonus' was not declared in this scope
biolog.cpp:193: error: 'arg3' was not declared in this scope
biolog.cpp:193: error: 'arg4' was not declared in this scope
biolog.cpp: In function 'bool SendBiolog_Data(CHARACTER*, int)':
biolog.cpp:209: error: 'pTablePercentage' was not declared in this scope
biolog.cpp:212: error: 'pTableLevel' was not declared in this scope
biolog.cpp:214: error: 'pTable_Translate' was not declared in this scope
biolog.cpp:218: error: 'pTableTime' was not declared in this scope
biolog.cpp:227: error: 'pTable_Translate' was not declared in this scope
biolog.cpp:227: error: 'days' was not declared in this scope
biolog.cpp:227: error: 'hours' was not declared in this scope
biolog.cpp:231: error: 'pTableVnum' was not declared in this scope
biolog.cpp:241: error: 'pTableCountMax' was not declared in this scope
biolog.cpp:245: error: 'pTableTime' was not declared in this scope
biolog.cpp:280: error: 'pTable_Translate' was not declared in this scope
biolog.cpp: In member function 'bool BiologManager::SendButton(CHARACTER*)':
biolog.cpp:294: error: 'pTable_Translate' was not declared in this scope
biolog.cpp:298: error: 'pTableCountMax' was not declared in this scope
biolog.cpp:306: error: 'pTableCountMax' was not declared in this scope
biolog.cpp: In member function 'bool BiologManager::SendUpdate_Binary(CHARACTER*)':
biolog.cpp:327: error: 'pTableCountMax' was not declared in this scope
biolog.cpp:327: error: 'pTableVnum' was not declared in this scope
biolog.cpp:332: error: 'pTableCountMax' was not declared in this scope
biolog.cpp:332: error: 'pTableVnum' was not declared in this scope
compile offlineshop_manager.cpp
gmake: *** [OBJDIR/biolog.o] Error 1
gmake: *** Waiting for unfinished jobs....
Am adaugat si acel fisiel, nu il vazusem...
acu primesc eroarea :
ABBC3_SPOILER_SHOW
biolog.cpp:30: error: 'AFF_BIO_17' was not declared in this scope
biolog.cpp:30: error: 'AFF_BIO_18' was not declared in this scope
biolog.cpp:30: error: 'AFF_BIO_19' was not declared in this scope
biolog.cpp:30: error: 'AFF_BIO_20' was not declared in this scope
biolog.cpp: In member function 'void BiologManager::SendBonusType(CHARACTER*, int)':
biolog.cpp:76: error: 'SendMessagePopUp' was not declared in this scope
biolog.cpp: In member function 'void BiologManager::SelectBonusType(CHARACTER*, const char*)':
biolog.cpp:135: error: 'SendMessagePopUp' was not declared in this scope
biolog.cpp:140: error: 'SendMessagePopUp' was not declared in this scope
biolog.cpp:145: error: 'SendMessagePopUp' was not declared in this scope
biolog.cpp:155: error: 'SendMessagePopUp' was not declared in this scope
biolog.cpp:160: error: 'SendMessagePopUp' was not declared in this scope
biolog.cpp: In member function 'void BiologManager::SendWindow_SelectType(CHARACTER*, int)':
biolog.cpp:193: error: 'arg3' was not declared in this scope
biolog.cpp:193: error: 'arg4' was not declared in this scope
biolog.cpp: In function 'bool SendBiolog_Data(CHARACTER*, int)':
biolog.cpp:227: error: 'days' was not declared in this scope
biolog.cpp:227: error: 'hours' was not declared in this scope
gmake: *** [OBJDIR/biolog.o] Error 1
gmake: *** Waiting for unfinished jobs....