Eroare compilare exchange.cpp

Totalitatea subiectelor care nu respectă regulamentul impus in sectiunea "Probleme şi Întrebări" vor fi stocate aici.
Avatar utilizator
haristhc
Nivel 3

Nivel 3
Mesaje: 362
Membru din: 27 Feb 2018, 02:15
Server: Wom2Ro
Regat: Chunjo
Aprecieri: 190  
Mulţumiri: 5  
Medalii

Ai idee de la ce ar putea fi ?
Avatar utilizator
haristhc
Nivel 3

Nivel 3
Mesaje: 362
Membru din: 27 Feb 2018, 02:15
Server: Wom2Ro
Regat: Chunjo
Aprecieri: 190  
Mulţumiri: 5  
Medalii

sTrix. scrie:
haristhc scrie:Default :
exchange.cpp - http://www.girlshare.ro/3490139629.9
exchange.h - http://www.girlshare.ro/3490144446.8

Cele din tutorial :

exchange.cpp - http://www.girlshare.ro/3490144447.9
exchange.h - http://www.girlshare.ro/3490144449
https://ufile.io/fddt7
Uite asta imi da la exchang-ul de la tine :

.obj/cmd_gm.o: In function `do_dice(CHARACTER*, char const*, int, int)':
/usr/src/Sursa/Colossus/game/src/cmd_gm.cpp:2914: multiple definition of `do_dice(CHARACTER*, char const*, int, int)'
.obj/cmd_general.o:/usr/src/Sursa/Colossus/game/src/cmd_general.cpp:3188: first defined here
collect2: error: ld returned 1 exit status
gmake: *** [../game_r41022] Error 1
Avatar utilizator
sTrix.
Nivel 5

Nivel 5
Mesaje: 807
Membru din: 15 Feb 2018, 17:52
Regat: Jinno
Aprecieri: 238  
Mulţumiri: 273  
Medalii

Nu e de la exchange, scrie ca a mai fost definit odata comanda aia in cmd_general.cpp. Da-mi cmd_general.cpp aici
Pentru acest mesaj, sTrix. for the post:
haristhc
Apasa Imagine daca te-am ajutat.
Imagine
Afișează semnătura
Avatar utilizator
haristhc
Nivel 3

Nivel 3
Mesaje: 362
Membru din: 27 Feb 2018, 02:15
Server: Wom2Ro
Regat: Chunjo
Aprecieri: 190  
Mulţumiri: 5  
Medalii

Avatar utilizator
sTrix.
Nivel 5

Nivel 5
Mesaje: 807
Membru din: 15 Feb 2018, 17:52
Regat: Jinno
Aprecieri: 238  
Mulţumiri: 273  
Medalii

Da-mi si cmd_gm.cpp
Pentru acest mesaj, sTrix. for the post:
haristhc
Apasa Imagine daca te-am ajutat.
Imagine
Afișează semnătura
Avatar utilizator
ZeNu
Utilizator neserios / Untrustworthy user !

Utilizator neserios / Untrustworthy user !
Mesaje: 625
Membru din: 03 Aug 2017, 21:43
Regat: Shinsoo
Aprecieri: 122  
Mulţumiri: 496  
 Contact:
Medalii

ACMD(do_dice) il ai si in cmd_general respectiv cmd_gm ...
Pentru acest mesaj, ZeNu for the post:
haristhc
Imagine
Afișează semnătura
Avatar utilizator
haristhc
Nivel 3

Nivel 3
Mesaje: 362
Membru din: 27 Feb 2018, 02:15
Server: Wom2Ro
Regat: Chunjo
Aprecieri: 190  
Mulţumiri: 5  
Medalii

Avatar utilizator
sTrix.
Nivel 5

Nivel 5
Mesaje: 807
Membru din: 15 Feb 2018, 17:52
Regat: Jinno
Aprecieri: 238  
Mulţumiri: 273  
Medalii

Pentru acest mesaj, sTrix. for the post:
haristhc
Apasa Imagine daca te-am ajutat.
Imagine
Afișează semnătura
Avatar utilizator
haristhc
Nivel 3

Nivel 3
Mesaje: 362
Membru din: 27 Feb 2018, 02:15
Server: Wom2Ro
Regat: Chunjo
Aprecieri: 190  
Mulţumiri: 5  
Medalii

sTrix. scrie:
haristhc scrie:cmd_gm.cpp - http://www.girlshare.ro/3490144471
https://ufile.io/mxl4j
A mers compilata fara nicio eroare , acu incerc sa termin clientu si iti spun daca merge sistemu barbut sau nu
Avatar utilizator
haristhc
Nivel 3

Nivel 3
Mesaje: 362
Membru din: 27 Feb 2018, 02:15
Server: Wom2Ro
Regat: Chunjo
Aprecieri: 190  
Mulţumiri: 5  
Medalii

0705 22:10:19314 :: Failed to load script file : uiscript/sash_absorbwindow.py
0705 22:10:19314 :: error : No file or directory
0705 22:10:19315 ::
ui.py(line:3188) LoadScriptFile
system.py(line:202) execfile
system.py(line:171) Run
system.py(line:186) __LoadTextFile__
system.py(line:71) __init__

LoadScriptFile1 - <type 'exceptions.IOError'>:No file or directory


De asta ai idee ce ar putea fi ?
Închis
Răspunsuri
10
Vizualizări
1079
Răspunsuri
13
Vizualizări
1284
Răspunsuri
5
Vizualizări
439
Răspunsuri
2
Vizualizări
224

Înapoi la “Arhivă Probleme şi Întrebări”

  • Informaţie
  • Cine este conectat

    Utilizatori ce ce navighează pe acest forum: Niciun utilizator înregistrat și 80 vizitatori