Problemă: Primesc niste erori la compilare shop.cpp
Tipologie server(PvM / PvP): PVM
Resursă folosită: -
ServerFiles utilizat: 40k
Syserr:
shop.cpp: In member function 'virtual int CShop::Buy(CHARACTER*, BYTE)':
shop.cpp:680: error: 'class CHARACTER' has no member named 'SendGold'
shop.cpp:731: error: 'class CHARACTER' has no member named 'SendGold'
shop.cpp:763: error: 'g_bItemCountLimit' was not declared in this scope
gmake: *** [OBJDIR/shop.o] Error 1
Poză: -
Detalii suplimentare: Va rog frumos sa ma ajutati.
Problema compilare
Răspunsuri
1 Vizualizări
373
1 Vizualizări
373
-
- Informaţie
-
Cine este conectat
Utilizatori ce ce navighează pe acest forum: Baidu [Spider], marian261 și 43 vizitatori



