Cod: Selectaţi tot
shop.cpp: In member function 'virtual int CShop::Buy(CHARACTER*, BYTE)':
shop.cpp:847: error: a function-definition is not allowed here before '{' token
shop.cpp:1324: error: expected `}' at end of input
gmake: *** [OBJDIR/shop.o] Error 1*Resursă folosită: http://just4metin.ro/sursa/offline-shop ... 23-20.html
*ServerFiles utilizat: Fliege
*Syserr:
Poză:
*Detalii suplimentare:
Functia de pe linia 847:
Cod: Selectaţi tot
https://pastebin.com/CNsEF6PRCod: Selectaţi tot
https://pastebin.com/Uaqk878z




