Compilare Sursa FreeBSD 11.2 32bit

Înainte de a posta o problemă, caută în acest forum și poate găsești rezolvare.
Închis
Avatar utilizator
K3nnTHD
Nivel 2

Nivel 2
Mesaje: 192
Membru din: 29 Noi 2013, 20:29
Aprecieri: 66  
Mulţumiri: 3  
 Contact:
Medalii

*Problemă: Compilare Sursa FreeBSD 11.2 32bit imi da urmatoarea problema! se compileaza tot, doar ca la final cand incearca sa creeze fisierul GAME imi da urmatoarea eroare:
Tipologie server(PvM / PvP): PVP
*Resursă folosită: Serverfiles Metin2GNS 2017 - Premium [+Src]
*ServerFiles utilizat:Serverfiles Metin2GNS 2017 - Premium [+Src]
*Syserr:
In file included from ../../../Extern/include/cryptopp/modes.h:8:0,
from cipher.cpp:7:
../../../Extern/include/cryptopp/secblock.h: In instantiation of 'CryptoPP::AllocatorWithCleanup<T, T_Align16>::pointer CryptoPP::AllocatorWithCleanup<T, T_Align16>::allocate(CryptoPP::AllocatorWithCleanup<T, T_Align16>::size_type, const void*) [with T = unsigned char; bool T_Align16 = false; CryptoPP::AllocatorWithCleanup<T, T_Align16>::pointer = unsigned char*; CryptoPP::AllocatorWithCleanup<T, T_Align16>::size_type = unsigned int]':
../../../Extern/include/cryptopp/secblock.h:247:25: required from 'CryptoPP::SecBlock<T, A>::SecBlock(CryptoPP::SecBlock<T, A>::size_type) [with T = unsigned char; A = CryptoPP::AllocatorWithCleanup<unsigned char>; CryptoPP::SecBlock<T, A>::size_type = unsigned int]'
../../../Extern/include/cryptopp/algparam.h:17:2: required from here
../../../Extern/include/cryptopp/secblock.h:91:14: error: 'CheckSize' was not declared in this scope, and no declarations were found by argument-dependent lookup at the point of instantiation [-fpermissive]
CheckSize(n);
^
../../../Extern/include/cryptopp/secblock.h:91:14: note: declarations in dependent base 'CryptoPP::AllocatorBase<unsigned char>' are not found by unqualified lookup
../../../Extern/include/cryptopp/secblock.h:91:14: note: use 'this->CheckSize' instead
../../../Extern/include/cryptopp/secblock.h: In instantiation of 'CryptoPP::AllocatorWithCleanup<T, T_Align16>::pointer CryptoPP::AllocatorWithCleanup<T, T_Align16>::allocate(CryptoPP::AllocatorWithCleanup<T, T_Align16>::size_type, const void*) [with T = unsigned char; bool T_Align16 = true; CryptoPP::AllocatorWithCleanup<T, T_Align16>::pointer = unsigned char*; CryptoPP::AllocatorWithCleanup<T, T_Align16>::size_type = unsigned int]':
../../../Extern/include/cryptopp/secblock.h:247:25: required from 'CryptoPP::SecBlock<T, A>::SecBlock(CryptoPP::SecBlock<T, A>::size_type) [with T = unsigned char; A = CryptoPP::AllocatorWithCleanup<unsigned char, true>; CryptoPP::SecBlock<T, A>::size_type = unsigned int]'
../../../Extern/include/cryptopp/modes.h:63:34: required from here
../../../Extern/include/cryptopp/secblock.h:91:14: error: 'CheckSize' was not declared in this scope, and no declarations were found by argument-dependent lookup at the point of instantiation [-fpermissive]
../../../Extern/include/cryptopp/secblock.h:91:14: note: declarations in dependent base 'CryptoPP::AllocatorBase<unsigned char>' are not found by unqualified lookup
../../../Extern/include/cryptopp/secblock.h:91:14: note: use 'this->CheckSize' instead
../../../Extern/include/cryptopp/secblock.h: In instantiation of 'CryptoPP::AllocatorWithCleanup<T, T_Align16>::pointer CryptoPP::AllocatorWithCleanup<T, T_Align16>::allocate(CryptoPP::AllocatorWithCleanup<T, T_Align16>::size_type, const void*) [with T = unsigned int; bool T_Align16 = true; CryptoPP::AllocatorWithCleanup<T, T_Align16>::pointer = unsigned int*; CryptoPP::AllocatorWithCleanup<T, T_Align16>::size_type = unsigned int]':
../../../Extern/include/cryptopp/secblock.h:249:29: required from 'CryptoPP::SecBlock<T, A>::SecBlock(const CryptoPP::SecBlock<T, A>&) [with T = unsigned int; A = CryptoPP::AllocatorWithCleanup<unsigned int, true>]'
../../../Extern/include/cryptopp/modarith.h:122:20: required from here
../../../Extern/include/cryptopp/secblock.h:91:14: error: 'CheckSize' was not declared in this scope, and no declarations were found by argument-dependent lookup at the point of instantiation [-fpermissive]
../../../Extern/include/cryptopp/secblock.h:91:14: note: declarations in dependent base 'CryptoPP::AllocatorBase<unsigned int>' are not found by unqualified lookup
../../../Extern/include/cryptopp/secblock.h:91:14: note: use 'this->CheckSize' instead
../../../Extern/include/cryptopp/secblock.h: In instantiation of 'CryptoPP::AllocatorWithCleanup<T, T_Align16>::pointer CryptoPP::AllocatorWithCleanup<T, T_Align16>::allocate(CryptoPP::AllocatorWithCleanup<T, T_Align16>::size_type, const void*) [with T = unsigned int; bool T_Align16 = false; CryptoPP::AllocatorWithCleanup<T, T_Align16>::pointer = unsigned int*; CryptoPP::AllocatorWithCleanup<T, T_Align16>::size_type = unsigned int]':
../../../Extern/include/cryptopp/secblock.h:247:25: required from 'CryptoPP::SecBlock<T, A>::SecBlock(CryptoPP::SecBlock<T, A>::size_type) [with T = unsigned int; A = CryptoPP::AllocatorWithCleanup<unsigned int>; CryptoPP::SecBlock<T, A>::size_type = unsigned int]'
../../../Extern/include/cryptopp/rc5.h:22:27: required from 'CryptoPP::BlockCipherFinal<DIR, BASE>::BlockCipherFinal() [with CryptoPP::CipherDir DIR = (CryptoPP::CipherDir)0u; BASE = CryptoPP::RC5::Enc]'
../../../Extern/include/cryptopp/misc.h:82:7: required from 'CryptoPP::CipherModeFinalTemplate_CipherHolder<CIPHER, BASE>::CipherModeFinalTemplate_CipherHolder(const byte*, size_t, const byte*) [with CIPHER = CryptoPP::BlockCipherFinal<(CryptoPP::CipherDir)0u, CryptoPP::RC5::Enc>; BASE = CryptoPP::ConcretePolicyHolder<CryptoPP::Empty, CryptoPP::AdditiveCipherTemplate<CryptoPP::AbstractPolicyHolder<CryptoPP::AdditiveCipherAbstractPolicy, CryptoPP::CTR_ModePolicy> > >; byte = unsigned char; size_t = unsigned int]'
cipher.cpp:88:64: required from 'CryptoPP::SymmetricCipher* BlockCipherDetail<T>::CreateEncoder(const byte*, size_t, const byte*) const [with T = CryptoPP::RC5; byte = unsigned char; size_t = unsigned int]'
cipher.cpp:398:1: required from here
../../../Extern/include/cryptopp/secblock.h:91:14: error: 'CheckSize' was not declared in this scope, and no declarations were found by argument-dependent lookup at the point of instantiation [-fpermissive]
../../../Extern/include/cryptopp/secblock.h:91:14: note: declarations in dependent base 'CryptoPP::AllocatorBase<unsigned int>' are not found by unqualified lookup
../../../Extern/include/cryptopp/secblock.h:91:14: note: use 'this->CheckSize' instead
gmake: *** [Makefile:75: .obj_game/cipher.o] Error 1
gmake: *** Waiting for unfinished jobs....
Poză:Imagine *Detalii suplimentare:
Avatar utilizator
BeauDeCiuda
Utilizator interzis !

Utilizator interzis !
Mesaje: 1915
Membru din: 24 Mar 2014, 16:25
Server: http://infomanii.ro
Regat: Chunjo
Aprecieri: 169  
Mulţumiri: 225  
 Contact:
Medalii

lipseste externul.
Imagine
Afișează semnătura
Avatar utilizator
K3nnTHD
Nivel 2

Nivel 2
Mesaje: 192
Membru din: 29 Noi 2013, 20:29
Aprecieri: 66  
Mulţumiri: 3  
 Contact:
Medalii

BeauDeCiuda scrie:lipseste externul.
Am fisierul Extern Imagine
Avatar utilizator
BeauDeCiuda
Utilizator interzis !

Utilizator interzis !
Mesaje: 1915
Membru din: 24 Mar 2014, 16:25
Server: http://infomanii.ro
Regat: Chunjo
Aprecieri: 169  
Mulţumiri: 225  
 Contact:
Medalii

nu e bun, in folderul ../../../ nu ai
../../../ = usr/src/numesursa/EXTERN e pus aiurea sau nu il ai complet. modifica-l de unde sa citeasca
Imagine
Afișează semnătura
Avatar utilizator
K3nnTHD
Nivel 2

Nivel 2
Mesaje: 192
Membru din: 29 Noi 2013, 20:29
Aprecieri: 66  
Mulţumiri: 3  
 Contact:
Medalii

Am modificat Directorul in Makefile din game dupa cel corespunzator pentru Extern si imi da aceiasi eroare! sti de unde pot descarca Extern full?
Avatar utilizator
BeauDeCiuda
Utilizator interzis !

Utilizator interzis !
Mesaje: 1915
Membru din: 24 Mar 2014, 16:25
Server: http://infomanii.ro
Regat: Chunjo
Aprecieri: 169  
Mulţumiri: 225  
 Contact:
Medalii

Nu am idee.. dar cine mai foloseste gns in 2018?.....
Imagine
Afișează semnătura
Avatar utilizator
K3nnTHD
Nivel 2

Nivel 2
Mesaje: 192
Membru din: 29 Noi 2013, 20:29
Aprecieri: 66  
Mulţumiri: 3  
 Contact:
Medalii

poi asta l-am gasit pe hardisk extern... poti sa imi dai tu o sugestie?
Avatar utilizator
BeauDeCiuda
Utilizator interzis !

Utilizator interzis !
Mesaje: 1915
Membru din: 24 Mar 2014, 16:25
Server: http://infomanii.ro
Regat: Chunjo
Aprecieri: 169  
Mulţumiri: 225  
 Contact:
Medalii

Imagine
Afișează semnătura
Avatar utilizator
K3nnTHD
Nivel 2

Nivel 2
Mesaje: 192
Membru din: 29 Noi 2013, 20:29
Aprecieri: 66  
Mulţumiri: 3  
 Contact:
Medalii

Avatar utilizator
BeauDeCiuda
Utilizator interzis !

Utilizator interzis !
Mesaje: 1915
Membru din: 24 Mar 2014, 16:25
Server: http://infomanii.ro
Regat: Chunjo
Aprecieri: 169  
Mulţumiri: 225  
 Contact:
Medalii

Rezolvat,
T/C
Imagine
Afișează semnătura
Închis

Înapoi la “Probleme rezolvate”

  • Informaţie
  • Cine este conectat

    Utilizatori ce ce navighează pe acest forum: Niciun utilizator înregistrat și 30 vizitatori