In file included from desc.h:7:0,
from arena.cpp:5:
cipher.h:31:33: error: expected primary-expression before ')' token
encoder_->ProcessData((byte*)buffer, (const byte*)buffer, length);
^
cipher.h:31:49: error: ISO C++ forbids declaration of 'type name' with no type [-fpermissive]
encoder_->ProcessData((byte*)buffer, (const byte*)buffer, length);
^
In file included from desc.h:7:0,
from desc.cpp:4:
cipher.h: In member function 'void Cipher::Encrypt(void*, size_t)':
cipher.h:31:28: error: 'byte' was not declared in this scope
encoder_->ProcessData((byte*)buffer, (const byte*)buffer, length);
^
cipher.h:31:28: note: suggested alternative:
In file included from desc.h:7:0,
from desc_manager.cpp:5:
cipher.h: In member function 'void Cipher::Encrypt(void*, size_t)':
cipher.h:31:28: error: 'byte' was not declared in this scope
encoder_->ProcessData((byte*)buffer, (const byte*)buffer, length);
^
cipher.h:31:28: note: suggested alternative:
gmake: *** [Makefile:73: .obj_game/desc_p2p.o] Error 1
cipher.h:31:43: error: expected primary-expression before 'const'
encoder_->ProcessData((byte*)buffer, (const byte*)buffer, length);
^
In file included from ../../../Extern/include/cryptopp/cryptlib.h:102:0,
from cipher.h:6,
from desc.h:7,
from desc_manager.cpp:5:
../../../Extern/include/cryptopp/config.h:237:23: note: 'CryptoPP::byte'
typedef unsigned char byte;
^
In file included from ../../../Extern/include/cryptopp/cryptlib.h:102:0,
from cipher.h:6,
from desc.h:7,
from desc.cpp:4:
../../../Extern/include/cryptopp/config.h:237:23: note: 'CryptoPP::byte'
typedef unsigned char byte;
^
In file included from desc.h:7:0,
from desc_manager.cpp:5:
cipher.h:31:33: error: expected primary-expression before ')' token
encoder_->ProcessData((byte*)buffer, (const byte*)buffer, length);
^
In file included from desc.h:7:0,
from desc.cpp:4:
cipher.h:31:33: error: expected primary-expression before ')' token
encoder_->ProcessData((byte*)buffer, (const byte*)buffer, length);
^
cipher.h:31:49: error: ISO C++ forbids declaration of 'type name' with no type [-fpermissive]
encoder_->ProcessData((byte*)buffer, (const byte*)buffer, length);
^
cipher.h:31:49: error: ISO C++ forbids declaration of 'type name' with no type [-fpermissive]
encoder_->ProcessData((byte*)buffer, (const byte*)buffer, length);
^
cipher.h:31:43: error: expected primary-expression before 'const'
encoder_->ProcessData((byte*)buffer, (const byte*)buffer, length);
^
cipher.h:31:43: error: expected primary-expression before 'const'
encoder_->ProcessData((byte*)buffer, (const byte*)buffer, length);
^
cipher.h:31:43: error: expected ')' before 'const'
cipher.h:31:43: error: expected ')' before 'const'
cipher.h: In member function 'void Cipher::Decrypt(void*, size_t)':
cipher.h:39:28: error: 'byte' was not declared in this scope
decoder_->ProcessData((byte*)buffer, (const byte*)buffer, length);
^
cipher.h: In member function 'void Cipher::Decrypt(void*, size_t)':
cipher.h:39:28: error: 'byte' was not declared in this scope
decoder_->ProcessData((byte*)buffer, (const byte*)buffer, length);
^
cipher.h:39:28: note: suggested alternative:
cipher.h:39:28: note: suggested alternative:
In file included from ../../../Extern/include/cryptopp/cryptlib.h:102:0,
from cipher.h:6,
from desc.h:7,
from desc_manager.cpp:5:
../../../Extern/include/cryptopp/config.h:237:23: note: 'CryptoPP::byte'
typedef unsigned char byte;
^
In file included from ../../../Extern/include/cryptopp/cryptlib.h:102:0,
from cipher.h:6,
from desc.h:7,
from desc.cpp:4:
../../../Extern/include/cryptopp/config.h:237:23: note: 'CryptoPP::byte'
typedef unsigned char byte;
^
In file included from desc.h:7:0,
from desc_manager.cpp:5:
cipher.h:39:33: error: expected primary-expression before ')' token
decoder_->ProcessData((byte*)buffer, (const byte*)buffer, length);
^
In file included from desc.h:7:0,
from desc.cpp:4:
cipher.h:39:33: error: expected primary-expression before ')' token
decoder_->ProcessData((byte*)buffer, (const byte*)buffer, length);
^
cipher.h:39:49: error: ISO C++ forbids declaration of 'type name' with no type [-fpermissive]
decoder_->ProcessData((byte*)buffer, (const byte*)buffer, length);
^
cipher.h:39:49: error: ISO C++ forbids declaration of 'type name' with no type [-fpermissive]
decoder_->ProcessData((byte*)buffer, (const byte*)buffer, length);
^
cipher.h:39:43: error: expected primary-expression before 'const'
decoder_->ProcessData((byte*)buffer, (const byte*)buffer, length);
^
cipher.h:39:43: error: expected primary-expression before 'const'
decoder_->ProcessData((byte*)buffer, (const byte*)buffer, length);
^
cipher.h:39:43: error: expected ')' before 'const'
cipher.h:39:43: error: expected ')' before 'const'
gmake: *** Waiting for unfinished jobs....
cipher.h:31:43: error: expected ')' before 'const'
cipher.h: In member function 'void Cipher::Decrypt(void*, size_t)':
cipher.h:39:28: error: 'byte' was not declared in this scope
decoder_->ProcessData((byte*)buffer, (const byte*)buffer, length);
^
cipher.h:39:28: note: suggested alternative:
In file included from ../../../Extern/include/cryptopp/cryptlib.h:102:0,
from cipher.h:6,
from desc.h:7,
from arena.cpp:5:
../../../Extern/include/cryptopp/config.h:237:23: note: 'CryptoPP::byte'
typedef unsigned char byte;
^
In file included from desc.h:7:0,
from arena.cpp:5:
cipher.h:39:33: error: expected primary-expression before ')' token
decoder_->ProcessData((byte*)buffer, (const byte*)buffer, length);
^
cipher.h:39:49: error: ISO C++ forbids declaration of 'type name' with no type [-fpermissive]
decoder_->ProcessData((byte*)buffer, (const byte*)buffer, length);
^
cipher.h:39:43: error: expected primary-expression before 'const'
decoder_->ProcessData((byte*)buffer, (const byte*)buffer, length);
^
cipher.h:39:43: error: expected ')' before 'const'
In file included from desc.h:7:0,
from entity.cpp:3:
cipher.h: In member function 'void Cipher::Encrypt(void*, size_t)':
cipher.h:31:28: error: 'byte' was not declared in this scope
encoder_->ProcessData((byte*)buffer, (const byte*)buffer, length);
^
cipher.h:31:28: note: suggested alternative:
In file included from desc.h:7:0,
from char_skill.cpp:10:
cipher.h: In member function 'void Cipher::Encrypt(void*, size_t)':
cipher.h:31:28: error: 'byte' was not declared in this scope
encoder_->ProcessData((byte*)buffer, (const byte*)buffer, length);
^
cipher.h:31:28: note: suggested alternative:
gmake: *** [Makefile:73: .obj_game/desc_manager.o] Error 1
In file included from ../../../Extern/include/cryptopp/cryptlib.h:102:0,
from cipher.h:6,
from desc.h:7,
from entity.cpp:3:
../../../Extern/include/cryptopp/config.h:237:23: note: 'CryptoPP::byte'
typedef unsigned char byte;
^
In file included from desc.h:7:0,
from entity.cpp:3:
cipher.h:31:33: error: expected primary-expression before ')' token
encoder_->ProcessData((byte*)buffer, (const byte*)buffer, length);
^
cipher.h:31:49: error: ISO C++ forbids declaration of 'type name' with no type [-fpermissive]
encoder_->ProcessData((byte*)buffer, (const byte*)buffer, length);
^
cipher.h:31:43: error: expected primary-expression before 'const'
encoder_->ProcessData((byte*)buffer, (const byte*)buffer, length);
^
cipher.h:31:43: error: expected ')' before 'const'
cipher.h: In member function 'void Cipher::Decrypt(void*, size_t)':
cipher.h:39:28: error: 'byte' was not declared in this scope
decoder_->ProcessData((byte*)buffer, (const byte*)buffer, length);
^
cipher.h:39:28: note: suggested alternative:
In file included from ../../../Extern/include/cryptopp/cryptlib.h:102:0,
from cipher.h:6,
from desc.h:7,
from entity.cpp:3:
../../../Extern/include/cryptopp/config.h:237:23: note: 'CryptoPP::byte'
typedef unsigned char byte;
^
In file included from desc.h:7:0,
from entity.cpp:3:
cipher.h:39:33: error: expected primary-expression before ')' token
decoder_->ProcessData((byte*)buffer, (const byte*)buffer, length);
^
cipher.h:39:49: error: ISO C++ forbids declaration of 'type name' with no type [-fpermissive]
decoder_->ProcessData((byte*)buffer, (const byte*)buffer, length);
^
cipher.h:39:43: error: expected primary-expression before 'const'
decoder_->ProcessData((byte*)buffer, (const byte*)buffer, length);
^
cipher.h:39:43: error: expected ')' before 'const'
In file included from desc.h:7:0,
from exchange.cpp:4:
cipher.h: In member function 'void Cipher::Encrypt(void*, size_t)':
cipher.h:31:28: error: 'byte' was not declared in this scope
encoder_->ProcessData((byte*)buffer, (const byte*)buffer, length);
^
cipher.h:31:28: note: suggested alternative:
In file included from ../../../Extern/include/cryptopp/cryptlib.h:102:0,
from cipher.h:6,
from desc.h:7,
from exchange.cpp:4:
../../../Extern/include/cryptopp/config.h:237:23: note: 'CryptoPP::byte'
typedef unsigned char byte;
^
In file included from desc.h:7:0,
from exchange.cpp:4:
cipher.h:31:33: error: expected primary-expression before ')' token
encoder_->ProcessData((byte*)buffer, (const byte*)buffer, length);
^
cipher.h:31:49: error: ISO C++ forbids declaration of 'type name' with no type [-fpermissive]
encoder_->ProcessData((byte*)buffer, (const byte*)buffer, length);
^
cipher.h:31:43: error: expected primary-expression before 'const'
encoder_->ProcessData((byte*)buffer, (const byte*)buffer, length);
^
cipher.h:31:43: error: expected ')' before 'const'
cipher.h: In member function 'void Cipher::Decrypt(void*, size_t)':
cipher.h:39:28: error: 'byte' was not declared in this scope
decoder_->ProcessData((byte*)buffer, (const byte*)buffer, length);
^
cipher.h:39:28: note: suggested alternative:
In file included from ../../../Extern/include/cryptopp/cryptlib.h:102:0,
from cipher.h:6,
from desc.h:7,
from exchange.cpp:4:
../../../Extern/include/cryptopp/config.h:237:23: note: 'CryptoPP::byte'
typedef unsigned char byte;
^
In file included from desc.h:7:0,
from exchange.cpp:4:
cipher.h:39:33: error: expected primary-expression before ')' token
decoder_->ProcessData((byte*)buffer, (const byte*)buffer, length);
^
cipher.h:39:49: error: ISO C++ forbids declaration of 'type name' with no type [-fpermissive]
decoder_->ProcessData((byte*)buffer, (const byte*)buffer, length);
^
cipher.h:39:43: error: expected primary-expression before 'const'
decoder_->ProcessData((byte*)buffer, (const byte*)buffer, length);
^
cipher.h:39:43: error: expected ')' before 'const'
In file included from ../../../Extern/include/cryptopp/cryptlib.h:102:0,
from cipher.h:6,
from desc.h:7,
from char_skill.cpp:10:
../../../Extern/include/cryptopp/config.h:237:23: note: 'CryptoPP::byte'
typedef unsigned char byte;
^
In file included from desc.h:7:0,
from char_skill.cpp:10:
cipher.h:31:33: error: expected primary-expression before ')' token
encoder_->ProcessData((byte*)buffer, (const byte*)buffer, length);
^
cipher.h:31:49: error: ISO C++ forbids declaration of 'type name' with no type [-fpermissive]
encoder_->ProcessData((byte*)buffer, (const byte*)buffer, length);
^
cipher.h:31:43: error: expected primary-expression before 'const'
encoder_->ProcessData((byte*)buffer, (const byte*)buffer, length);
^
cipher.h:31:43: error: expected ')' before 'const'
cipher.h: In member function 'void Cipher::Decrypt(void*, size_t)':
cipher.h:39:28: error: 'byte' was not declared in this scope
decoder_->ProcessData((byte*)buffer, (const byte*)buffer, length);
^
cipher.h:39:28: note: suggested alternative:
In file included from ../../../Extern/include/cryptopp/cryptlib.h:102:0,
from cipher.h:6,
from desc.h:7,
from char_skill.cpp:10:
../../../Extern/include/cryptopp/config.h:237:23: note: 'CryptoPP::byte'
typedef unsigned char byte;
^
In file included from desc.h:7:0,
from char_skill.cpp:10:
cipher.h:39:33: error: expected primary-expression before ')' token
decoder_->ProcessData((byte*)buffer, (const byte*)buffer, length);
^
cipher.h:39:49: error: ISO C++ forbids declaration of 'type name' with no type [-fpermissive]
decoder_->ProcessData((byte*)buffer, (const byte*)buffer, length);
^
cipher.h:39:43: error: expected primary-expression before 'const'
decoder_->ProcessData((byte*)buffer, (const byte*)buffer, length);
^
cipher.h:39:43: error: expected ')' before 'const'
In file included from desc.h:7:0,
from cmd.cpp:7:
cipher.h: In member function 'void Cipher::Encrypt(void*, size_t)':
cipher.h:31:28: error: 'byte' was not declared in this scope
encoder_->ProcessData((byte*)buffer, (const byte*)buffer, length);
^
cipher.h:31:28: note: suggested alternative:
In file included from ../../../Extern/include/cryptopp/cryptlib.h:102:0,
from cipher.h:6,
from desc.h:7,
from cmd.cpp:7:
../../../Extern/include/cryptopp/config.h:237:23: note: 'CryptoPP::byte'
typedef unsigned char byte;
^
In file included from desc.h:7:0,
from cmd.cpp:7:
cipher.h:31:33: error: expected primary-expression before ')' token
encoder_->ProcessData((byte*)buffer, (const byte*)buffer, length);
^
cipher.h:31:49: error: ISO C++ forbids declaration of 'type name' with no type [-fpermissive]
encoder_->ProcessData((byte*)buffer, (const byte*)buffer, length);
^
cipher.h:31:43: error: expected primary-expression before 'const'
encoder_->ProcessData((byte*)buffer, (const byte*)buffer, length);
^
cipher.h:31:43: error: expected ')' before 'const'
cipher.h: In member function 'void Cipher::Decrypt(void*, size_t)':
cipher.h:39:28: error: 'byte' was not declared in this scope
decoder_->ProcessData((byte*)buffer, (const byte*)buffer, length);
^
cipher.h:39:28: note: suggested alternative:
In file included from ../../../Extern/include/cryptopp/cryptlib.h:102:0,
from cipher.h:6,
from desc.h:7,
from cmd.cpp:7:
../../../Extern/include/cryptopp/config.h:237:23: note: 'CryptoPP::byte'
typedef unsigned char byte;
^
In file included from desc.h:7:0,
from cmd.cpp:7:
cipher.h:39:33: error: expected primary-expression before ')' token
decoder_->ProcessData((byte*)buffer, (const byte*)buffer, length);
^
cipher.h:39:49: error: ISO C++ forbids declaration of 'type name' with no type [-fpermissive]
decoder_->ProcessData((byte*)buffer, (const byte*)buffer, length);
^
cipher.h:39:43: error: expected primary-expression before 'const'
decoder_->ProcessData((byte*)buffer, (const byte*)buffer, length);
^
cipher.h:39:43: error: expected ')' before 'const'
In file included from desc.h:7:0,
from char_manager.cpp:4:
cipher.h: In member function 'void Cipher::Encrypt(void*, size_t)':
cipher.h:31:28: error: 'byte' was not declared in this scope
encoder_->ProcessData((byte*)buffer, (const byte*)buffer, length);
^
In file included from ../../../Extern/include/cryptopp/cryptlib.h:102:0,
from cipher.h:6,
from desc.h:7,
from battle.cpp:4:
../../../Extern/include/cryptopp/config.h:237:23: note: 'CryptoPP::byte'
typedef unsigned char byte;
^
gmake: *** [Makefile:73: .obj_game/exchange.o] Error 1
In file included from desc.h:7:0,
from desc_client.h:4,
from guild_manager.cpp:9:
cipher.h: In member function 'void Cipher::Encrypt(void*, size_t)':
cipher.h:31:28: error: 'byte' was not declared in this scope
encoder_->ProcessData((byte*)buffer, (const byte*)buffer, length);
^
cipher.h:31:28: note: suggested alternative:
In file included from ../../../Extern/include/cryptopp/cryptlib.h:102:0,
from cipher.h:6,
from desc.h:7,
from desc_client.h:4,
from guild_manager.cpp:9:
../../../Extern/include/cryptopp/config.h:237:23: note: 'CryptoPP::byte'
typedef unsigned char byte;
^
In file included from desc.h:7:0,
from desc_client.h:4,
from guild_manager.cpp:9:
cipher.h:31:33: error: expected primary-expression before ')' token
encoder_->ProcessData((byte*)buffer, (const byte*)buffer, length);
^
cipher.h:31:49: error: ISO C++ forbids declaration of 'type name' with no type [-fpermissive]
encoder_->ProcessData((byte*)buffer, (const byte*)buffer, length);
^
cipher.h:31:43: error: expected primary-expression before 'const'
encoder_->ProcessData((byte*)buffer, (const byte*)buffer, length);
^
cipher.h:31:43: error: expected ')' before 'const'
cipher.h: In member function 'void Cipher::Decrypt(void*, size_t)':
cipher.h:39:28: error: 'byte' was not declared in this scope
decoder_->ProcessData((byte*)buffer, (const byte*)buffer, length);
^
cipher.h:39:28: note: suggested alternative:
In file included from ../../../Extern/include/cryptopp/cryptlib.h:102:0,
from cipher.h:6,
from desc.h:7,
from desc_client.h:4,
from guild_manager.cpp:9:
../../../Extern/include/cryptopp/config.h:237:23: note: 'CryptoPP::byte'
typedef unsigned char byte;
^
In file included from desc.h:7:0,
from desc_client.h:4,
from guild_manager.cpp:9:
cipher.h:39:33: error: expected primary-expression before ')' token
decoder_->ProcessData((byte*)buffer, (const byte*)buffer, length);
^
cipher.h:39:49: error: ISO C++ forbids declaration of 'type name' with no type [-fpermissive]
decoder_->ProcessData((byte*)buffer, (const byte*)buffer, length);
^
cipher.h:39:43: error: expected primary-expression before 'const'
decoder_->ProcessData((byte*)buffer, (const byte*)buffer, length);
^
cipher.h:39:43: error: expected ')' before 'const'
cipher.h:31:28: note: suggested alternative:
In file included from desc.h:7:0,
from desc_client.h:4,
from cmd_general.cpp:10:
cipher.h: In member function 'void Cipher::Encrypt(void*, size_t)':
cipher.h:31:28: error: 'byte' was not declared in this scope
encoder_->ProcessData((byte*)buffer, (const byte*)buffer, length);
^
cipher.h:31:28: note: suggested alternative:
In file included from ../../../Extern/include/cryptopp/cryptlib.h:102:0,
from cipher.h:6,
from desc.h:7,
from desc_client.h:4,
from cmd_general.cpp:10:
../../../Extern/include/cryptopp/config.h:237:23: note: 'CryptoPP::byte'
typedef unsigned char byte;
^
In file included from desc.h:7:0,
from desc_client.h:4,
from cmd_general.cpp:10:
cipher.h:31:33: error: expected primary-expression before ')' token
encoder_->ProcessData((byte*)buffer, (const byte*)buffer, length);
^
cipher.h:31:49: error: ISO C++ forbids declaration of 'type name' with no type [-fpermissive]
encoder_->ProcessData((byte*)buffer, (const byte*)buffer, length);
^
cipher.h:31:43: error: expected primary-expression before 'const'
encoder_->ProcessData((byte*)buffer, (const byte*)buffer, length);
^
cipher.h:31:43: error: expected ')' before 'const'
cipher.h: In member function 'void Cipher::Decrypt(void*, size_t)':
cipher.h:39:28: error: 'byte' was not declared in this scope
decoder_->ProcessData((byte*)buffer, (const byte*)buffer, length);
^
cipher.h:39:28: note: suggested alternative:
In file included from ../../../Extern/include/cryptopp/cryptlib.h:102:0,
from cipher.h:6,
from desc.h:7,
from desc_client.h:4,
from cmd_general.cpp:10:
../../../Extern/include/cryptopp/config.h:237:23: note: 'CryptoPP::byte'
typedef unsigned char byte;
^
In file included from desc.h:7:0,
from desc_client.h:4,
from cmd_general.cpp:10:
cipher.h:39:33: error: expected primary-expression before ')' token
decoder_->ProcessData((byte*)buffer, (const byte*)buffer, length);
^
cipher.h:39:49: error: ISO C++ forbids declaration of 'type name' with no type [-fpermissive]
decoder_->ProcessData((byte*)buffer, (const byte*)buffer, length);
^
cipher.h:39:43: error: expected primary-expression before 'const'
decoder_->ProcessData((byte*)buffer, (const byte*)buffer, length);
^
cipher.h:39:43: error: expected ')' before 'const'
In file included from desc.h:7:0,
from battle.cpp:4:
cipher.h:31:33: error: expected primary-expression before ')' token
encoder_->ProcessData((byte*)buffer, (const byte*)buffer, length);
^
gmake: *** [Makefile:73: .obj_game/guild_manager.o] Error 1
cipher.h:31:49: error: ISO C++ forbids declaration of 'type name' with no type [-fpermissive]
encoder_->ProcessData((byte*)buffer, (const byte*)buffer, length);
^
In file included from ../../../Extern/include/cryptopp/cryptlib.h:102:0,
from cipher.h:6,
from desc.h:7,
from char_manager.cpp:4:
../../../Extern/include/cryptopp/config.h:237:23: note: 'CryptoPP::byte'
typedef unsigned char byte;
^
In file included from desc.h:7:0,
from char_manager.cpp:4:
cipher.h:31:33: error: expected primary-expression before ')' token
encoder_->ProcessData((byte*)buffer, (const byte*)buffer, length);
^
cipher.h:31:49: error: ISO C++ forbids declaration of 'type name' with no type [-fpermissive]
encoder_->ProcessData((byte*)buffer, (const byte*)buffer, length);
^
cipher.h:31:43: error: expected primary-expression before 'const'
encoder_->ProcessData((byte*)buffer, (const byte*)buffer, length);
^
cipher.h:31:43: error: expected ')' before 'const'
cipher.h: In member function 'void Cipher::Decrypt(void*, size_t)':
cipher.h:39:28: error: 'byte' was not declared in this scope
decoder_->ProcessData((byte*)buffer, (const byte*)buffer, length);
^
cipher.h:39:28: note: suggested alternative:
In file included from ../../../Extern/include/cryptopp/cryptlib.h:102:0,
from cipher.h:6,
from desc.h:7,
from char_manager.cpp:4:
../../../Extern/include/cryptopp/config.h:237:23: note: 'CryptoPP::byte'
typedef unsigned char byte;
^
In file included from desc.h:7:0,
from char_manager.cpp:4:
cipher.h:39:33: error: expected primary-expression before ')' token
decoder_->ProcessData((byte*)buffer, (const byte*)buffer, length);
^
cipher.h:39:49: error: ISO C++ forbids declaration of 'type name' with no type [-fpermissive]
decoder_->ProcessData((byte*)buffer, (const byte*)buffer, length);
^
cipher.h:39:43: error: expected primary-expression before 'const'
decoder_->ProcessData((byte*)buffer, (const byte*)buffer, length);
^
cipher.h:39:43: error: expected ')' before 'const'
gmake: *** [Makefile:73: .obj_game/entity.o] Error 1
cipher.h:31:43: error: expected primary-expression before 'const'
encoder_->ProcessData((byte*)buffer, (const byte*)buffer, length);
^
gmake: *** [Makefile:73: .obj_game/desc.o] Error 1
cipher.h:31:43: error: expected ')' before 'const'
gmake: *** [Makefile:73: .obj_game/cmd.o] Error 1
cipher.h: In member function 'void Cipher::Decrypt(void*, size_t)':
cipher.h:39:28: error: 'byte' was not declared in this scope
decoder_->ProcessData((byte*)buffer, (const byte*)buffer, length);
^
gmake: *** [Makefile:73: .obj_game/char_skill.o] Error 1
cipher.h:39:28: note: suggested alternative:
In file included from desc.h:7:0,
from desc_client.h:4,
from guild.cpp:6:
cipher.h: In member function 'void Cipher::Encrypt(void*, size_t)':
cipher.h:31:28: error: 'byte' was not declared in this scope
encoder_->ProcessData((byte*)buffer, (const byte*)buffer, length);
^
cipher.h:31:28: note: suggested alternative:
In file included from desc.h:7:0,
from desc_client.h:4,
from guild_war.cpp:8:
cipher.h: In member function 'void Cipher::Encrypt(void*, size_t)':
cipher.h:31:28: error: 'byte' was not declared in this scope
encoder_->ProcessData((byte*)buffer, (const byte*)buffer, length);
^
cipher.h:31:28: note: suggested alternative:
In file included from desc.h:7:0,
from desc_client.h:4,
from char_affect.cpp:10:
cipher.h: In member function 'void Cipher::Encrypt(void*, size_t)':
cipher.h:31:28: error: 'byte' was not declared in this scope
encoder_->ProcessData((byte*)buffer, (const byte*)buffer, length);
^
gmake: *** [Makefile:73: .obj_game/arena.o] Error 1
In file included from desc.h:7:0,
from OXEvent.cpp:12:
cipher.h: In member function 'void Cipher::Encrypt(void*, size_t)':
cipher.h:31:28: error: 'byte' was not declared in this scope
encoder_->ProcessData((byte*)buffer, (const byte*)buffer, length);
^
In file included from ../../../Extern/include/cryptopp/cryptlib.h:102:0,
from cipher.h:6,
from desc.h:7,
from battle.cpp:4:
../../../Extern/include/cryptopp/config.h:237:23: note: 'CryptoPP::byte'
typedef unsigned char byte;
^
cipher.h:31:28: note: suggested alternative:
In file included from desc.h:7:0,
from config.cpp:10:
cipher.h: In member function 'void Cipher::Encrypt(void*, size_t)':
cipher.h:31:28: error: 'byte' was not declared in this scope
encoder_->ProcessData((byte*)buffer, (const byte*)buffer, length);
^
cipher.h:31:28: note: suggested alternative:
In file included from desc.h:7:0,
from battle.cpp:4:
cipher.h:39:33: error: expected primary-expression before ')' token
decoder_->ProcessData((byte*)buffer, (const byte*)buffer, length);
^
cipher.h:39:49: error: ISO C++ forbids declaration of 'type name' with no type [-fpermissive]
decoder_->ProcessData((byte*)buffer, (const byte*)buffer, length);
^
cipher.h:39:43: error: expected primary-expression before 'const'
decoder_->ProcessData((byte*)buffer, (const byte*)buffer, length);
^
cipher.h:39:43: error: expected ')' before 'const'
cipher.h:31:28: note: suggested alternative:
In file included from ../../../Extern/include/cryptopp/cryptlib.h:102:0,
from cipher.h:6,
from desc.h:7,
from desc_client.h:4,
from guild.cpp:6:
../../../Extern/include/cryptopp/config.h:237:23: note: 'CryptoPP::byte'
typedef unsigned char byte;
^
In file included from desc.h:7:0,
from desc_client.h:4,
from guild.cpp:6:
cipher.h:31:33: error: expected primary-expression before ')' token
encoder_->ProcessData((byte*)buffer, (const byte*)buffer, length);
^
cipher.h:31:49: error: ISO C++ forbids declaration of 'type name' with no type [-fpermissive]
encoder_->ProcessData((byte*)buffer, (const byte*)buffer, length);
^
cipher.h:31:43: error: expected primary-expression before 'const'
encoder_->ProcessData((byte*)buffer, (const byte*)buffer, length);
^
cipher.h:31:43: error: expected ')' before 'const'
cipher.h: In member function 'void Cipher::Decrypt(void*, size_t)':
cipher.h:39:28: error: 'byte' was not declared in this scope
decoder_->ProcessData((byte*)buffer, (const byte*)buffer, length);
^
cipher.h:39:28: note: suggested alternative:
In file included from ../../../Extern/include/cryptopp/cryptlib.h:102:0,
from cipher.h:6,
from desc.h:7,
from desc_client.h:4,
from guild.cpp:6:
../../../Extern/include/cryptopp/config.h:237:23: note: 'CryptoPP::byte'
typedef unsigned char byte;
^
In file included from desc.h:7:0,
from desc_client.h:4,
from guild.cpp:6:
cipher.h:39:33: error: expected primary-expression before ')' token
decoder_->ProcessData((byte*)buffer, (const byte*)buffer, length);
^
cipher.h:39:49: error: ISO C++ forbids declaration of 'type name' with no type [-fpermissive]
decoder_->ProcessData((byte*)buffer, (const byte*)buffer, length);
^
cipher.h:39:43: error: expected primary-expression before 'const'
decoder_->ProcessData((byte*)buffer, (const byte*)buffer, length);
^
cipher.h:39:43: error: expected ')' before 'const'
In file included from ../../../Extern/include/cryptopp/cryptlib.h:102:0,
from cipher.h:6,
from desc.h:7,
from desc_client.h:4,
from guild_war.cpp:8:
../../../Extern/include/cryptopp/config.h:237:23: note: 'CryptoPP::byte'
typedef unsigned char byte;
^
In file included from desc.h:7:0,
from desc_client.h:4,
from guild_war.cpp:8:
cipher.h:31:33: error: expected primary-expression before ')' token
encoder_->ProcessData((byte*)buffer, (const byte*)buffer, length);
^
cipher.h:31:49: error: ISO C++ forbids declaration of 'type name' with no type [-fpermissive]
encoder_->ProcessData((byte*)buffer, (const byte*)buffer, length);
^
cipher.h:31:43: error: expected primary-expression before 'const'
encoder_->ProcessData((byte*)buffer, (const byte*)buffer, length);
^
cipher.h:31:43: error: expected ')' before 'const'
cipher.h: In member function 'void Cipher::Decrypt(void*, size_t)':
cipher.h:39:28: error: 'byte' was not declared in this scope
decoder_->ProcessData((byte*)buffer, (const byte*)buffer, length);
^
cipher.h:39:28: note: suggested alternative:
In file included from ../../../Extern/include/cryptopp/cryptlib.h:102:0,
from cipher.h:6,
from desc.h:7,
from desc_client.h:4,
from guild_war.cpp:8:
../../../Extern/include/cryptopp/config.h:237:23: note: 'CryptoPP::byte'
typedef unsigned char byte;
^
In file included from desc.h:7:0,
from desc_client.h:4,
from guild_war.cpp:8:
cipher.h:39:33: error: expected primary-expression before ')' token
decoder_->ProcessData((byte*)buffer, (const byte*)buffer, length);
^
cipher.h:39:49: error: ISO C++ forbids declaration of 'type name' with no type [-fpermissive]
decoder_->ProcessData((byte*)buffer, (const byte*)buffer, length);
^
cipher.h:39:43: error: expected primary-expression before 'const'
decoder_->ProcessData((byte*)buffer, (const byte*)buffer, length);
^
cipher.h:39:43: error: expected ')' before 'const'
In file included from desc.h:7:0,
from desc_client.h:4,
from fishing.cpp:21:
cipher.h: In member function 'void Cipher::Encrypt(void*, size_t)':
cipher.h:31:28: error: 'byte' was not declared in this scope
encoder_->ProcessData((byte*)buffer, (const byte*)buffer, length);
^
cipher.h:31:28: note: suggested alternative:
In file included from ../../../Extern/include/cryptopp/cryptlib.h:102:0,
from cipher.h:6,
from desc.h:7,
from desc_client.h:4,
from fishing.cpp:21:
../../../Extern/include/cryptopp/config.h:237:23: note: 'CryptoPP::byte'
typedef unsigned char byte;
^
In file included from desc.h:7:0,
from desc_client.h:4,
from fishing.cpp:21:
cipher.h:31:33: error: expected primary-expression before ')' token
encoder_->ProcessData((byte*)buffer, (const byte*)buffer, length);
^
cipher.h:31:49: error: ISO C++ forbids declaration of 'type name' with no type [-fpermissive]
encoder_->ProcessData((byte*)buffer, (const byte*)buffer, length);
^
cipher.h:31:43: error: expected primary-expression before 'const'
encoder_->ProcessData((byte*)buffer, (const byte*)buffer, length);
^
cipher.h:31:43: error: expected ')' before 'const'
cipher.h: In member function 'void Cipher::Decrypt(void*, size_t)':
cipher.h:39:28: error: 'byte' was not declared in this scope
decoder_->ProcessData((byte*)buffer, (const byte*)buffer, length);
^
cipher.h:39:28: note: suggested alternative:
In file included from ../../../Extern/include/cryptopp/cryptlib.h:102:0,
from cipher.h:6,
from desc.h:7,
from desc_client.h:4,
from fishing.cpp:21:
../../../Extern/include/cryptopp/config.h:237:23: note: 'CryptoPP::byte'
typedef unsigned char byte;
^
In file included from desc.h:7:0,
from desc_client.h:4,
from fishing.cpp:21:
cipher.h:39:33: error: expected primary-expression before ')' token
decoder_->ProcessData((byte*)buffer, (const byte*)buffer, length);
^
cipher.h:39:49: error: ISO C++ forbids declaration of 'type name' with no type [-fpermissive]
decoder_->ProcessData((byte*)buffer, (const byte*)buffer, length);
^
cipher.h:39:43: error: expected primary-expression before 'const'
decoder_->ProcessData((byte*)buffer, (const byte*)buffer, length);
^
cipher.h:39:43: error: expected ')' before 'const'
gmake: *** [Makefile:73: .obj_game/fishing.o] Error 1
In file included from ../../../Extern/include/cryptopp/cryptlib.h:102:0,
from cipher.h:6,
from desc.h:7,
from config.cpp:10:
../../../Extern/include/cryptopp/config.h:237:23: note: 'CryptoPP::byte'
typedef unsigned char byte;
^
In file included from desc.h:7:0,
from config.cpp:10:
cipher.h:31:33: error: expected primary-expression before ')' token
encoder_->ProcessData((byte*)buffer, (const byte*)buffer, length);
^
cipher.h:31:49: error: ISO C++ forbids declaration of 'type name' with no type [-fpermissive]
encoder_->ProcessData((byte*)buffer, (const byte*)buffer, length);
^
cipher.h:31:43: error: expected primary-expression before 'const'
encoder_->ProcessData((byte*)buffer, (const byte*)buffer, length);
^
cipher.h:31:43: error: expected ')' before 'const'
cipher.h: In member function 'void Cipher::Decrypt(void*, size_t)':
cipher.h:39:28: error: 'byte' was not declared in this scope
decoder_->ProcessData((byte*)buffer, (const byte*)buffer, length);
^
cipher.h:39:28: note: suggested alternative:
In file included from ../../../Extern/include/cryptopp/cryptlib.h:102:0,
from cipher.h:6,
from desc.h:7,
from config.cpp:10:
../../../Extern/include/cryptopp/config.h:237:23: note: 'CryptoPP::byte'
typedef unsigned char byte;
^
In file included from desc.h:7:0,
from config.cpp:10:
cipher.h:39:33: error: expected primary-expression before ')' token
decoder_->ProcessData((byte*)buffer, (const byte*)buffer, length);
^
cipher.h:39:49: error: ISO C++ forbids declaration of 'type name' with no type [-fpermissive]
decoder_->ProcessData((byte*)buffer, (const byte*)buffer, length);
^
cipher.h:39:43: error: expected primary-expression before 'const'
decoder_->ProcessData((byte*)buffer, (const byte*)buffer, length);
^
cipher.h:39:43: error: expected ')' before 'const'
gmake: *** [Makefile:73: .obj_game/guild.o] Error 1
In file included from desc.h:7:0,
from desc_client.h:4,
from desc_client.cpp:4:
cipher.h: In member function 'void Cipher::Encrypt(void*, size_t)':
cipher.h:31:28: error: 'byte' was not declared in this scope
encoder_->ProcessData((byte*)buffer, (const byte*)buffer, length);
^
cipher.h:31:28: note: suggested alternative:
gmake: *** [Makefile:73: .obj_game/guild_war.o] Error 1
In file included from ../../../Extern/include/cryptopp/cryptlib.h:102:0,
from cipher.h:6,
from desc.h:7,
from desc_client.h:4,
from desc_client.cpp:4:
../../../Extern/include/cryptopp/config.h:237:23: note: 'CryptoPP::byte'
typedef unsigned char byte;
^
In file included from desc.h:7:0,
from desc_client.h:4,
from desc_client.cpp:4:
cipher.h:31:33: error: expected primary-expression before ')' token
encoder_->ProcessData((byte*)buffer, (const byte*)buffer, length);
^
cipher.h:31:49: error: ISO C++ forbids declaration of 'type name' with no type [-fpermissive]
encoder_->ProcessData((byte*)buffer, (const byte*)buffer, length);
^
cipher.h:31:43: error: expected primary-expression before 'const'
encoder_->ProcessData((byte*)buffer, (const byte*)buffer, length);
^
cipher.h:31:43: error: expected ')' before 'const'
cipher.h: In member function 'void Cipher::Decrypt(void*, size_t)':
cipher.h:39:28: error: 'byte' was not declared in this scope
decoder_->ProcessData((byte*)buffer, (const byte*)buffer, length);
^
cipher.h:39:28: note: suggested alternative:
In file included from ../../../Extern/include/cryptopp/cryptlib.h:102:0,
from cipher.h:6,
from desc.h:7,
from desc_client.h:4,
from desc_client.cpp:4:
../../../Extern/include/cryptopp/config.h:237:23: note: 'CryptoPP::byte'
typedef unsigned char byte;
^
In file included from desc.h:7:0,
from desc_client.h:4,
from desc_client.cpp:4:
cipher.h:39:33: error: expected primary-expression before ')' token
decoder_->ProcessData((byte*)buffer, (const byte*)buffer, length);
^
cipher.h:39:49: error: ISO C++ forbids declaration of 'type name' with no type [-fpermissive]
decoder_->ProcessData((byte*)buffer, (const byte*)buffer, length);
^
cipher.h:39:43: error: expected primary-expression before 'const'
decoder_->ProcessData((byte*)buffer, (const byte*)buffer, length);
^
cipher.h:39:43: error: expected ')' before 'const'
In file included from desc.h:7:0,
from desc_client.h:4,
from char.cpp:14:
cipher.h: In member function 'void Cipher::Encrypt(void*, size_t)':
cipher.h:31:28: error: 'byte' was not declared in this scope
encoder_->ProcessData((byte*)buffer, (const byte*)buffer, length);
^
cipher.h:31:28: note: suggested alternative:
In file included from ../../../Extern/include/cryptopp/cryptlib.h:102:0,
from cipher.h:6,
from desc.h:7,
from desc_client.h:4,
from char.cpp:14:
../../../Extern/include/cryptopp/config.h:237:23: note: 'CryptoPP::byte'
typedef unsigned char byte;
^
In file included from desc.h:7:0,
from desc_client.h:4,
from char.cpp:14:
cipher.h:31:33: error: expected primary-expression before ')' token
encoder_->ProcessData((byte*)buffer, (const byte*)buffer, length);
^
cipher.h:31:49: error: ISO C++ forbids declaration of 'type name' with no type [-fpermissive]
encoder_->ProcessData((byte*)buffer, (const byte*)buffer, length);
^
cipher.h:31:43: error: expected primary-expression before 'const'
encoder_->ProcessData((byte*)buffer, (const byte*)buffer, length);
^
cipher.h:31:43: error: expected ')' before 'const'
cipher.h: In member function 'void Cipher::Decrypt(void*, size_t)':
cipher.h:39:28: error: 'byte' was not declared in this scope
decoder_->ProcessData((byte*)buffer, (const byte*)buffer, length);
^
cipher.h:39:28: note: suggested alternative:
In file included from ../../../Extern/include/cryptopp/cryptlib.h:102:0,
from cipher.h:6,
from desc.h:7,
from desc_client.h:4,
from char.cpp:14:
../../../Extern/include/cryptopp/config.h:237:23: note: 'CryptoPP::byte'
typedef unsigned char byte;
^
In file included from desc.h:7:0,
from desc_client.h:4,
from char.cpp:14:
cipher.h:39:33: error: expected primary-expression before ')' token
decoder_->ProcessData((byte*)buffer, (const byte*)buffer, length);
^
cipher.h:39:49: error: ISO C++ forbids declaration of 'type name' with no type [-fpermissive]
decoder_->ProcessData((byte*)buffer, (const byte*)buffer, length);
^
cipher.h:39:43: error: expected primary-expression before 'const'
decoder_->ProcessData((byte*)buffer, (const byte*)buffer, length);
^
cipher.h:39:43: error: expected ')' before 'const'
In file included from ../../../Extern/include/cryptopp/cryptlib.h:102:0,
from cipher.h:6,
from desc.h:7,
from desc_client.h:4,
from char_affect.cpp:10:
../../../Extern/include/cryptopp/config.h:237:23: note: 'CryptoPP::byte'
typedef unsigned char byte;
^
gmake: *** [Makefile:73: .obj_game/desc_client.o] Error 1
In file included from ../../../Extern/include/cryptopp/cryptlib.h:102:0,
from cipher.h:6,
from desc.h:7,
from OXEvent.cpp:12:
../../../Extern/include/cryptopp/config.h:237:23: note: 'CryptoPP::byte'
typedef unsigned char byte;
^
In file included from desc.h:7:0,
from char_quickslot.cpp:4:
cipher.h: In member function 'void Cipher::Encrypt(void*, size_t)':
cipher.h:31:28: error: 'byte' was not declared in this scope
encoder_->ProcessData((byte*)buffer, (const byte*)buffer, length);
^
cipher.h:31:28: note: suggested alternative:
In file included from ../../../Extern/include/cryptopp/cryptlib.h:102:0,
from cipher.h:6,
from desc.h:7,
from char_quickslot.cpp:4:
../../../Extern/include/cryptopp/config.h:237:23: note: 'CryptoPP::byte'
typedef unsigned char byte;
^
In file included from desc.h:7:0,
from char_quickslot.cpp:4:
cipher.h:31:33: error: expected primary-expression before ')' token
encoder_->ProcessData((byte*)buffer, (const byte*)buffer, length);
^
cipher.h:31:49: error: ISO C++ forbids declaration of 'type name' with no type [-fpermissive]
encoder_->ProcessData((byte*)buffer, (const byte*)buffer, length);
^
cipher.h:31:43: error: expected primary-expression before 'const'
encoder_->ProcessData((byte*)buffer, (const byte*)buffer, length);
^
cipher.h:31:43: error: expected ')' before 'const'
cipher.h: In member function 'void Cipher::Decrypt(void*, size_t)':
cipher.h:39:28: error: 'byte' was not declared in this scope
decoder_->ProcessData((byte*)buffer, (const byte*)buffer, length);
^
cipher.h:39:28: note: suggested alternative:
In file included from ../../../Extern/include/cryptopp/cryptlib.h:102:0,
from cipher.h:6,
from desc.h:7,
from char_quickslot.cpp:4:
../../../Extern/include/cryptopp/config.h:237:23: note: 'CryptoPP::byte'
typedef unsigned char byte;
^
In file included from desc.h:7:0,
from char_quickslot.cpp:4:
cipher.h:39:33: error: expected primary-expression before ')' token
decoder_->ProcessData((byte*)buffer, (const byte*)buffer, length);
^
cipher.h:39:49: error: ISO C++ forbids declaration of 'type name' with no type [-fpermissive]
decoder_->ProcessData((byte*)buffer, (const byte*)buffer, length);
^
cipher.h:39:43: error: expected primary-expression before 'const'
decoder_->ProcessData((byte*)buffer, (const byte*)buffer, length);
^
cipher.h:39:43: error: expected ')' before 'const'
In file included from desc.h:7:0,
from dungeon.cpp:8:
cipher.h: In member function 'void Cipher::Encrypt(void*, size_t)':
cipher.h:31:28: error: 'byte' was not declared in this scope
encoder_->ProcessData((byte*)buffer, (const byte*)buffer, length);
^
cipher.h:31:28: note: suggested alternative:
In file included from ../../../Extern/include/cryptopp/cryptlib.h:102:0,
from cipher.h:6,
from desc.h:7,
from dungeon.cpp:8:
../../../Extern/include/cryptopp/config.h:237:23: note: 'CryptoPP::byte'
typedef unsigned char byte;
^
In file included from desc.h:7:0,
from dungeon.cpp:8:
cipher.h:31:33: error: expected primary-expression before ')' token
encoder_->ProcessData((byte*)buffer, (const byte*)buffer, length);
^
cipher.h:31:49: error: ISO C++ forbids declaration of 'type name' with no type [-fpermissive]
encoder_->ProcessData((byte*)buffer, (const byte*)buffer, length);
^
cipher.h:31:43: error: expected primary-expression before 'const'
encoder_->ProcessData((byte*)buffer, (const byte*)buffer, length);
^
cipher.h:31:43: error: expected ')' before 'const'
cipher.h: In member function 'void Cipher::Decrypt(void*, size_t)':
cipher.h:39:28: error: 'byte' was not declared in this scope
decoder_->ProcessData((byte*)buffer, (const byte*)buffer, length);
^
cipher.h:39:28: note: suggested alternative:
In file included from ../../../Extern/include/cryptopp/cryptlib.h:102:0,
from cipher.h:6,
from desc.h:7,
from dungeon.cpp:8:
../../../Extern/include/cryptopp/config.h:237:23: note: 'CryptoPP::byte'
typedef unsigned char byte;
^
In file included from desc.h:7:0,
from dungeon.cpp:8:
cipher.h:39:33: error: expected primary-expression before ')' token
decoder_->ProcessData((byte*)buffer, (const byte*)buffer, length);
^
cipher.h:39:49: error: ISO C++ forbids declaration of 'type name' with no type [-fpermissive]
decoder_->ProcessData((byte*)buffer, (const byte*)buffer, length);
^
cipher.h:39:43: error: expected primary-expression before 'const'
decoder_->ProcessData((byte*)buffer, (const byte*)buffer, length);
^
cipher.h:39:43: error: expected ')' before 'const'
In file included from desc.h:7:0,
from desc_client.h:4,
from horsename_manager.cpp:4:
cipher.h: In member function 'void Cipher::Encrypt(void*, size_t)':
cipher.h:31:28: error: 'byte' was not declared in this scope
encoder_->ProcessData((byte*)buffer, (const byte*)buffer, length);
^
cipher.h:31:28: note: suggested alternative:
In file included from ../../../Extern/include/cryptopp/cryptlib.h:102:0,
from cipher.h:6,
from desc.h:7,
from desc_client.h:4,
from horsename_manager.cpp:4:
../../../Extern/include/cryptopp/config.h:237:23: note: 'CryptoPP::byte'
typedef unsigned char byte;
^
In file included from desc.h:7:0,
from desc_client.h:4,
from horsename_manager.cpp:4:
cipher.h:31:33: error: expected primary-expression before ')' token
encoder_->ProcessData((byte*)buffer, (const byte*)buffer, length);
^
cipher.h:31:49: error: ISO C++ forbids declaration of 'type name' with no type [-fpermissive]
encoder_->ProcessData((byte*)buffer, (const byte*)buffer, length);
^
cipher.h:31:43: error: expected primary-expression before 'const'
encoder_->ProcessData((byte*)buffer, (const byte*)buffer, length);
^
cipher.h:31:43: error: expected ')' before 'const'
cipher.h: In member function 'void Cipher::Decrypt(void*, size_t)':
cipher.h:39:28: error: 'byte' was not declared in this scope
decoder_->ProcessData((byte*)buffer, (const byte*)buffer, length);
^
cipher.h:39:28: note: suggested alternative:
In file included from ../../../Extern/include/cryptopp/cryptlib.h:102:0,
from cipher.h:6,
from desc.h:7,
from desc_client.h:4,
from horsename_manager.cpp:4:
../../../Extern/include/cryptopp/config.h:237:23: note: 'CryptoPP::byte'
typedef unsigned char byte;
^
In file included from desc.h:7:0,
from desc_client.h:4,
from horsename_manager.cpp:4:
cipher.h:39:33: error: expected primary-expression before ')' token
decoder_->ProcessData((byte*)buffer, (const byte*)buffer, length);
^
cipher.h:39:49: error: ISO C++ forbids declaration of 'type name' with no type [-fpermissive]
decoder_->ProcessData((byte*)buffer, (const byte*)buffer, length);
^
cipher.h:39:43: error: expected primary-expression before 'const'
decoder_->ProcessData((byte*)buffer, (const byte*)buffer, length);
^
cipher.h:39:43: error: expected ')' before 'const'
gmake: *** [Makefile:73: .obj_game/horsename_manager.o] Error 1
In file included from desc.h:7:0,
from OXEvent.cpp:12:
cipher.h:31:33: error: expected primary-expression before ')' token
encoder_->ProcessData((byte*)buffer, (const byte*)buffer, length);
^
In file included from desc.h:7:0,
from desc_client.h:4,
from char_affect.cpp:10:
cipher.h:31:33: error: expected primary-expression before ')' token
encoder_->ProcessData((byte*)buffer, (const byte*)buffer, length);
^
gmake: *** [Makefile:73: .obj_game/dungeon.o] Error 1
cipher.h:31:49: error: ISO C++ forbids declaration of 'type name' with no type [-fpermissive]
encoder_->ProcessData((byte*)buffer, (const byte*)buffer, length);
^
cipher.h:31:49: error: ISO C++ forbids declaration of 'type name' with no type [-fpermissive]
encoder_->ProcessData((byte*)buffer, (const byte*)buffer, length);
^
gmake: *** [Makefile:73: .obj_game/char_quickslot.o] Error 1
cipher.h:31:43: error: expected primary-expression before 'const'
encoder_->ProcessData((byte*)buffer, (const byte*)buffer, length);
^
cipher.h:31:43: error: expected primary-expression before 'const'
encoder_->ProcessData((byte*)buffer, (const byte*)buffer, length);
^
cipher.h:31:43: error: expected ')' before 'const'
cipher.h:31:43: error: expected ')' before 'const'
cipher.h: In member function 'void Cipher::Decrypt(void*, size_t)':
cipher.h:39:28: error: 'byte' was not declared in this scope
gmake: *** [Makefile:73: .obj_game/cmd_gm.o] Error 1