Tipologie server: PVM
*Resursă folosită:http://just4metin.ro/sursa/chest-view-drop-t68803.html
*ServerFiles utilizat: Fliege
*Syserr: In client nu apare nimic
Poză: las tot ce scrie in putty
*Detalii suplimentare:
gmake: Warning: File `../../common/service.h' has modification time 40421 s in the future
compile BattleArena.cpp
compile FSM.cpp
compile MarkConvert.cpp
compile MarkImage.cpp
compile MarkManager.cpp
compile OXEvent.cpp
compile TrafficProfiler.cpp
compile ani.cpp
compile arena.cpp
compile banword.cpp
compile battle.cpp
compile blend_item.cpp
compile block_country.cpp
compile buffer_manager.cpp
compile building.cpp
In file included from battle.cpp:9:
item_manager.h:153: error: expected ';' before 'int'
In file included from battle.cpp:15:
guild.h:47: error: expected `;' before end of line
guild.h:47: error: expected `}' before end of line
In file included from battle.cpp:9:
item_manager.h: In constructor 'CSpecialItemGroup::CSpecialItemGroup(DWORD, BYTE)':
item_manager.h:67: error: class 'CSpecialItemGroup' does not have any field named 'm_dwVnum'
item_manager.h:67: error: class 'CSpecialItemGroup' does not have any field named 'm_bType'
item_manager.h: In member function 'void CSpecialItemGroup::AddItem(DWORD, int, int, int)':
item_manager.h:74: error: 'm_vecProbs' was not declared in this scope
item_manager.h:76: error: 'm_vecProbs' was not declared in this scope
item_manager.h:77: error: 'm_vecItems' was not declared in this scope
item_manager.h: In member function 'bool CSpecialItemGroup::IsEmpty() const':
item_manager.h:82: error: 'm_vecProbs' was not declared in this scope
item_manager.h: In member function 'int CSpecialItemGroup::GetMultiIndex(std::vector<int, std::allocator<int> >&) const':
item_manager.h:92: error: 'm_bType' was not declared in this scope
item_manager.h:95: error: 'm_vecProbs' was not declared in this scope
item_manager.h
error: 'm_vecProbs' was not declared in this scope
item_manager.h: In member function 'int CSpecialItemGroup::GetOneIndex() const':
item_manager.h:119: error: 'm_vecProbs' was not declared in this scope
item_manager.h:120: error: invalid type in declaration before '=' token
item_manager.h:120: error: 'lower_bound' was not declared in this scope
item_manager.h: In member function 'int CSpecialItemGroup::GetVnum(int) const':
item_manager.h:126: error: 'm_vecItems' was not declared in this scope
item_manager.h: In member function 'int CSpecialItemGroup::GetCount(int) const':
item_manager.h:131: error: 'm_vecItems' was not declared in this scope
item_manager.h: In member function 'int CSpecialItemGroup::GetRarePct(int) const':
item_manager.h:136: error: 'm_vecItems' was not declared in this scope
item_manager.h: In member function 'bool CSpecialItemGroup::Contains(DWORD) const':
item_manager.h:141: error: 'm_vecItems' was not declared in this scope
In file included from battle.cpp:15:
guild.h: At global scope:
guild.h:47: error: expected unqualified-id before end of line
guild.h:47: error: expected declaration before end of line
compile castle.cpp
gmake: *** [OBJDIR/battle.o] Error 1
gmake: *** Waiting for unfinished jobs....
In file included from building.cpp:4:
item_manager.h:153: error: expected ';' before 'int'
In file included from building.cpp:10:
guild.h:47: error: expected `;' before end of line
guild.h:47: error: expected `}' before end of line
In file included from building.cpp:4:
item_manager.h: In constructor 'CSpecialItemGroup::CSpecialItemGroup(DWORD, BYTE)':
item_manager.h:67: error: class 'CSpecialItemGroup' does not have any field named 'm_dwVnum'
item_manager.h:67: error: class 'CSpecialItemGroup' does not have any field named 'm_bType'
item_manager.h: In member function 'void CSpecialItemGroup::AddItem(DWORD, int, int, int)':
item_manager.h:74: error: 'm_vecProbs' was not declared in this scope
item_manager.h:76: error: 'm_vecProbs' was not declared in this scope
item_manager.h:77: error: 'm_vecItems' was not declared in this scope
item_manager.h: In member function 'bool CSpecialItemGroup::IsEmpty() const':
item_manager.h:82: error: 'm_vecProbs' was not declared in this scope
item_manager.h: In member function 'int CSpecialItemGroup::GetMultiIndex(std::vector<int, std::allocator<int> >&) const':
item_manager.h:92: error: 'm_bType' was not declared in this scope
item_manager.h:95: error: 'm_vecProbs' was not declared in this scope
item_manager.h
error: 'm_vecProbs' was not declared in this scope
item_manager.h: In member function 'int CSpecialItemGroup::GetOneIndex() const':
item_manager.h:119: error: 'm_vecProbs' was not declared in this scope
item_manager.h:120: error: invalid type in declaration before '=' token
item_manager.h:120: error: 'lower_bound' was not declared in this scope
item_manager.h: In member function 'int CSpecialItemGroup::GetVnum(int) const':
item_manager.h:126: error: 'm_vecItems' was not declared in this scope
item_manager.h: In member function 'int CSpecialItemGroup::GetCount(int) const':
item_manager.h:131: error: 'm_vecItems' was not declared in this scope
item_manager.h: In member function 'int CSpecialItemGroup::GetRarePct(int) const':
item_manager.h:136: error: 'm_vecItems' was not declared in this scope
item_manager.h: In member function 'bool CSpecialItemGroup::Contains(DWORD) const':
item_manager.h:141: error: 'm_vecItems' was not declared in this scope
In file included from building.cpp:10:
guild.h: At global scope:
guild.h:47: error: expected unqualified-id before end of line
guild.h:47: error: expected declaration before end of line
gmake: *** [OBJDIR/building.o] Error 1
root@localhost:/usr/src/Source/Server/game/src #
root@localhost:/usr/src/Source/Server/game/src #
compile BattleArena.cpp
compile FSM.cpp
compile MarkConvert.cpp
compile MarkImage.cpp
compile MarkManager.cpp
compile OXEvent.cpp
compile TrafficProfiler.cpp
compile ani.cpp
compile arena.cpp
compile banword.cpp
compile battle.cpp
compile blend_item.cpp
compile block_country.cpp
compile buffer_manager.cpp
compile building.cpp
In file included from battle.cpp:9:
item_manager.h:153: error: expected ';' before 'int'
In file included from battle.cpp:15:
guild.h:47: error: expected `;' before end of line
guild.h:47: error: expected `}' before end of line
In file included from battle.cpp:9:
item_manager.h: In constructor 'CSpecialItemGroup::CSpecialItemGroup(DWORD, BYTE)':
item_manager.h:67: error: class 'CSpecialItemGroup' does not have any field named 'm_dwVnum'
item_manager.h:67: error: class 'CSpecialItemGroup' does not have any field named 'm_bType'
item_manager.h: In member function 'void CSpecialItemGroup::AddItem(DWORD, int, int, int)':
item_manager.h:74: error: 'm_vecProbs' was not declared in this scope
item_manager.h:76: error: 'm_vecProbs' was not declared in this scope
item_manager.h:77: error: 'm_vecItems' was not declared in this scope
item_manager.h: In member function 'bool CSpecialItemGroup::IsEmpty() const':
item_manager.h:82: error: 'm_vecProbs' was not declared in this scope
item_manager.h: In member function 'int CSpecialItemGroup::GetMultiIndex(std::vector<int, std::allocator<int> >&) const':
item_manager.h:92: error: 'm_bType' was not declared in this scope
item_manager.h:95: error: 'm_vecProbs' was not declared in this scope
item_manager.h
item_manager.h: In member function 'int CSpecialItemGroup::GetOneIndex() const':
item_manager.h:119: error: 'm_vecProbs' was not declared in this scope
item_manager.h:120: error: invalid type in declaration before '=' token
item_manager.h:120: error: 'lower_bound' was not declared in this scope
item_manager.h: In member function 'int CSpecialItemGroup::GetVnum(int) const':
item_manager.h:126: error: 'm_vecItems' was not declared in this scope
item_manager.h: In member function 'int CSpecialItemGroup::GetCount(int) const':
item_manager.h:131: error: 'm_vecItems' was not declared in this scope
item_manager.h: In member function 'int CSpecialItemGroup::GetRarePct(int) const':
item_manager.h:136: error: 'm_vecItems' was not declared in this scope
item_manager.h: In member function 'bool CSpecialItemGroup::Contains(DWORD) const':
item_manager.h:141: error: 'm_vecItems' was not declared in this scope
In file included from battle.cpp:15:
guild.h: At global scope:
guild.h:47: error: expected unqualified-id before end of line
guild.h:47: error: expected declaration before end of line
compile castle.cpp
gmake: *** [OBJDIR/battle.o] Error 1
gmake: *** Waiting for unfinished jobs....
In file included from building.cpp:4:
item_manager.h:153: error: expected ';' before 'int'
In file included from building.cpp:10:
guild.h:47: error: expected `;' before end of line
guild.h:47: error: expected `}' before end of line
In file included from building.cpp:4:
item_manager.h: In constructor 'CSpecialItemGroup::CSpecialItemGroup(DWORD, BYTE)':
item_manager.h:67: error: class 'CSpecialItemGroup' does not have any field named 'm_dwVnum'
item_manager.h:67: error: class 'CSpecialItemGroup' does not have any field named 'm_bType'
item_manager.h: In member function 'void CSpecialItemGroup::AddItem(DWORD, int, int, int)':
item_manager.h:74: error: 'm_vecProbs' was not declared in this scope
item_manager.h:76: error: 'm_vecProbs' was not declared in this scope
item_manager.h:77: error: 'm_vecItems' was not declared in this scope
item_manager.h: In member function 'bool CSpecialItemGroup::IsEmpty() const':
item_manager.h:82: error: 'm_vecProbs' was not declared in this scope
item_manager.h: In member function 'int CSpecialItemGroup::GetMultiIndex(std::vector<int, std::allocator<int> >&) const':
item_manager.h:92: error: 'm_bType' was not declared in this scope
item_manager.h:95: error: 'm_vecProbs' was not declared in this scope
item_manager.h
item_manager.h: In member function 'int CSpecialItemGroup::GetOneIndex() const':
item_manager.h:119: error: 'm_vecProbs' was not declared in this scope
item_manager.h:120: error: invalid type in declaration before '=' token
item_manager.h:120: error: 'lower_bound' was not declared in this scope
item_manager.h: In member function 'int CSpecialItemGroup::GetVnum(int) const':
item_manager.h:126: error: 'm_vecItems' was not declared in this scope
item_manager.h: In member function 'int CSpecialItemGroup::GetCount(int) const':
item_manager.h:131: error: 'm_vecItems' was not declared in this scope
item_manager.h: In member function 'int CSpecialItemGroup::GetRarePct(int) const':
item_manager.h:136: error: 'm_vecItems' was not declared in this scope
item_manager.h: In member function 'bool CSpecialItemGroup::Contains(DWORD) const':
item_manager.h:141: error: 'm_vecItems' was not declared in this scope
In file included from building.cpp:10:
guild.h: At global scope:
guild.h:47: error: expected unqualified-id before end of line
guild.h:47: error: expected declaration before end of line
gmake: *** [OBJDIR/building.o] Error 1
root@localhost:/usr/src/Source/Server/game/src #
root@localhost:/usr/src/Source/Server/game/src #
Help




