Tipologie server(PvM / PvP):
*Resursă folosită: *Link exclusiv J4M*http://just4metin.ro/sursa/shaman-syste ... 69707.html
*ServerFiles utilizat: http://just4metin.ro/serverfiles/server ... 52010.html
*Syserr: (erorile nu sysser)
Warning 76 warning C4800: 'BOOL' : forcing value to bool 'true' or 'false' (performance warning) C:\Users\Marian\Desktop\server\Serverfiles bun 2k19\Aureva2 SRC BIN\source\UserInterface\NetworkActorManager.cpp 367 1 UserInterface
Warning 77 warning C4800: 'BOOL' : forcing value to bool 'true' or 'false' (performance warning) C:\Users\Marian\Desktop\server\Serverfiles bun 2k19\Aureva2 SRC BIN\source\UserInterface\NetworkActorManager.cpp 417 1 UserInterface
Warning 79 warning C4101: 'iSourceSlotIndex' : unreferenced local variable C:\Users\Marian\Desktop\server\Serverfiles bun 2k19\Aureva2 SRC BIN\source\UserInterface\PythonPlayerModule.cpp 763 1 UserInterface
Warning 80 warning C4101: 'iSlotPos' : unreferenced local variable C:\Users\Marian\Desktop\server\Serverfiles bun 2k19\Aureva2 SRC BIN\source\UserInterface\PythonPlayerModule.cpp 978 1 UserInterface
Error 61 error C2601: 'CInstanceBase::SetWeapon' : local function definitions are illegal C:\Users\Marian\Desktop\server\Serverfiles bun 2k19\Aureva2 SRC BIN\source\UserInterface\InstanceBase.cpp 2774 1 UserInterface
Error 4 error C2601: 'CInstanceBase::SetStateFlags' : local function definitions are illegal C:\Users\Marian\Desktop\server\Serverfiles bun 2k19\Aureva2 SRC BIN\source\UserInterface\InstanceBase.cpp 2114 1 UserInterface
Error 56 error C2601: 'CInstanceBase::SetShape' : local function definitions are illegal C:\Users\Marian\Desktop\server\Serverfiles bun 2k19\Aureva2 SRC BIN\source\UserInterface\InstanceBase.cpp 2640 1 UserInterface
Error 48 error C2601: 'CInstanceBase::SetRenderMode' : local function definitions are illegal C:\Users\Marian\Desktop\server\Serverfiles bun 2k19\Aureva2 SRC BIN\source\UserInterface\InstanceBase.cpp 2562 1 UserInterface
Error 1 error C2601: 'CInstanceBase::SetPKMode' : local function definitions are illegal C:\Users\Marian\Desktop\server\Serverfiles bun 2k19\Aureva2 SRC BIN\source\UserInterface\InstanceBase.cpp 2086 1 UserInterface
Error 3 error C2601: 'CInstanceBase::SetPartyMemberFlag' : local function definitions are illegal C:\Users\Marian\Desktop\server\Serverfiles bun 2k19\Aureva2 SRC BIN\source\UserInterface\InstanceBase.cpp 2109 1 UserInterface
Error 47 error C2601: 'CInstanceBase::SetModulateRenderMode' : local function definitions are illegal C:\Users\Marian\Desktop\server\Serverfiles bun 2k19\Aureva2 SRC BIN\source\UserInterface\InstanceBase.cpp 2557 1 UserInterface
Error 2 error C2601: 'CInstanceBase::SetKiller' : local function definitions are illegal C:\Users\Marian\Desktop\server\Serverfiles bun 2k19\Aureva2 SRC BIN\source\UserInterface\InstanceBase.cpp 2100 1 UserInterface
Error 53 error C2601: 'CInstanceBase::SetHair' : local function definitions are illegal C:\Users\Marian\Desktop\server\Serverfiles bun 2k19\Aureva2 SRC BIN\source\UserInterface\InstanceBase.cpp 2590 1 UserInterface
Error 9 error C2601: 'CInstanceBase::SetDuelMode' : local function definitions are illegal C:\Users\Marian\Desktop\server\Serverfiles bun 2k19\Aureva2 SRC BIN\source\UserInterface\InstanceBase.cpp 2164 1 UserInterface
Error 5 error C2601: 'CInstanceBase::SetComboType' : local function definitions are illegal C:\Users\Marian\Desktop\server\Serverfiles bun 2k19\Aureva2 SRC BIN\source\UserInterface\InstanceBase.cpp 2127 1 UserInterface
Error 55 error C2601: 'CInstanceBase::SetArmor' : local function definitions are illegal C:\Users\Marian\Desktop\server\Serverfiles bun 2k19\Aureva2 SRC BIN\source\UserInterface\InstanceBase.cpp 2620 1 UserInterface
Error 46 error C2601: 'CInstanceBase::SetAddRenderMode' : local function definitions are illegal C:\Users\Marian\Desktop\server\Serverfiles bun 2k19\Aureva2 SRC BIN\source\UserInterface\InstanceBase.cpp 2552 1 UserInterface
Error 49 error C2601: 'CInstanceBase::SetAddColor' : local function definitions are illegal C:\Users\Marian\Desktop\server\Serverfiles bun 2k19\Aureva2 SRC BIN\source\UserInterface\InstanceBase.cpp 2567 1 UserInterface
Error 45 error C2601: 'CInstanceBase::RestoreRenderMode' : local function definitions are illegal C:\Users\Marian\Desktop\server\Serverfiles bun 2k19\Aureva2 SRC BIN\source\UserInterface\InstanceBase.cpp 2547 1 UserInterface
Error 67 error C2601: 'CInstanceBase::RegisterBoundingSphere' : local function definitions are illegal C:\Users\Marian\Desktop\server\Serverfiles bun 2k19\Aureva2 SRC BIN\source\UserInterface\InstanceBase.cpp 3003 1 UserInterface
Error 66 error C2601: 'CInstanceBase::RefreshState' : local function definitions are illegal C:\Users\Marian\Desktop\server\Serverfiles bun 2k19\Aureva2 SRC BIN\source\UserInterface\InstanceBase.cpp 2878 1 UserInterface
Error 43 error C2601: 'CInstanceBase::RefreshActorInstance' : local function definitions are illegal C:\Users\Marian\Desktop\server\Serverfiles bun 2k19\Aureva2 SRC BIN\source\UserInterface\InstanceBase.cpp 2537 1 UserInterface
Error 44 error C2601: 'CInstanceBase::Refresh' : local function definitions are illegal C:\Users\Marian\Desktop\server\Serverfiles bun 2k19\Aureva2 SRC BIN\source\UserInterface\InstanceBase.cpp 2542 1 UserInterface
Error 28 error C2601: 'CInstanceBase::IsWoodenDoor' : local function definitions are illegal C:\Users\Marian\Desktop\server\Serverfiles bun 2k19\Aureva2 SRC BIN\source\UserInterface\InstanceBase.cpp 2417 1 UserInterface
Error 23 error C2601: 'CInstanceBase::IsWarp' : local function definitions are illegal C:\Users\Marian\Desktop\server\Serverfiles bun 2k19\Aureva2 SRC BIN\source\UserInterface\InstanceBase.cpp 2392 1 UserInterface
Error 12 error C2601: 'CInstanceBase::IsTargetableInstance' : local function definitions are illegal C:\Users\Marian\Desktop\server\Serverfiles bun 2k19\Aureva2 SRC BIN\source\UserInterface\InstanceBase.cpp 2278 1 UserInterface
Error 29 error C2601: 'CInstanceBase::IsStoneDoor' : local function definitions are illegal C:\Users\Marian\Desktop\server\Serverfiles bun 2k19\Aureva2 SRC BIN\source\UserInterface\InstanceBase.cpp 2435 1 UserInterface
Error 20 error C2601: 'CInstanceBase::IsStone' : local function definitions are illegal C:\Users\Marian\Desktop\server\Serverfiles bun 2k19\Aureva2 SRC BIN\source\UserInterface\InstanceBase.cpp 2352 1 UserInterface
Error 22 error C2601: 'CInstanceBase::IsResource' : local function definitions are illegal C:\Users\Marian\Desktop\server\Serverfiles bun 2k19\Aureva2 SRC BIN\source\UserInterface\InstanceBase.cpp 2364 1 UserInterface
Error 16 error C2601: 'CInstanceBase::IsPoly' : local function definitions are illegal C:\Users\Marian\Desktop\server\Serverfiles bun 2k19\Aureva2 SRC BIN\source\UserInterface\InstanceBase.cpp 2332 1 UserInterface
Error 17 error C2601: 'CInstanceBase::IsPC' : local function definitions are illegal C:\Users\Marian\Desktop\server\Serverfiles bun 2k19\Aureva2 SRC BIN\source\UserInterface\InstanceBase.cpp 2337 1 UserInterface
Error 25 error C2601: 'CInstanceBase::IsObject' : local function definitions are illegal C:\Users\Marian\Desktop\server\Serverfiles bun 2k19\Aureva2 SRC BIN\source\UserInterface\InstanceBase.cpp 2402 1 UserInterface
Error 18 error C2601: 'CInstanceBase::IsNPC' : local function definitions are illegal C:\Users\Marian\Desktop\server\Serverfiles bun 2k19\Aureva2 SRC BIN\source\UserInterface\InstanceBase.cpp 2342 1 UserInterface
Error 21 error C2601: 'CInstanceBase::IsGuildWall' : local function definitions are illegal C:\Users\Marian\Desktop\server\Serverfiles bun 2k19\Aureva2 SRC BIN\source\UserInterface\InstanceBase.cpp 2358 1 UserInterface
Error 24 error C2601: 'CInstanceBase::IsGoto' : local function definitions are illegal C:\Users\Marian\Desktop\server\Serverfiles bun 2k19\Aureva2 SRC BIN\source\UserInterface\InstanceBase.cpp 2397 1 UserInterface
Error 31 error C2601: 'CInstanceBase::IsForceVisible' : local function definitions are illegal C:\Users\Marian\Desktop\server\Serverfiles bun 2k19\Aureva2 SRC BIN\source\UserInterface\InstanceBase.cpp 2452 1 UserInterface
Error 30 error C2601: 'CInstanceBase::IsFlag' : local function definitions are illegal C:\Users\Marian\Desktop\server\Serverfiles bun 2k19\Aureva2 SRC BIN\source\UserInterface\InstanceBase.cpp 2440 1 UserInterface
Error 19 error C2601: 'CInstanceBase::IsEnemy' : local function definitions are illegal C:\Users\Marian\Desktop\server\Serverfiles bun 2k19\Aureva2 SRC BIN\source\UserInterface\InstanceBase.cpp 2347 1 UserInterface
Error 27 error C2601: 'CInstanceBase::IsDoor' : local function definitions are illegal C:\Users\Marian\Desktop\server\Serverfiles bun 2k19\Aureva2 SRC BIN\source\UserInterface\InstanceBase.cpp 2412 1 UserInterface
Error 8 error C2601: 'CInstanceBase::IsConflictAlignmentInstance' : local function definitions are illegal C:\Users\Marian\Desktop\server\Serverfiles bun 2k19\Aureva2 SRC BIN\source\UserInterface\InstanceBase.cpp 2143 1 UserInterface
Error 26 error C2601: 'CInstanceBase::IsBuilding' : local function definitions are illegal C:\Users\Marian\Desktop\server\Serverfiles bun 2k19\Aureva2 SRC BIN\source\UserInterface\InstanceBase.cpp 2407 1 UserInterface
Error 11 error C2601: 'CInstanceBase::IsAttackableInstance' : local function definitions are illegal C:\Users\Marian\Desktop\server\Serverfiles bun 2k19\Aureva2 SRC BIN\source\UserInterface\InstanceBase.cpp 2174 1 UserInterface
Error 38 error C2601: 'CInstanceBase::IntersectDefendingSphere' : local function definitions are illegal C:\Users\Marian\Desktop\server\Serverfiles bun 2k19\Aureva2 SRC BIN\source\UserInterface\InstanceBase.cpp 2504 1 UserInterface
Error 37 error C2601: 'CInstanceBase::IntersectBoundingBox' : local function definitions are illegal C:\Users\Marian\Desktop\server\Serverfiles bun 2k19\Aureva2 SRC BIN\source\UserInterface\InstanceBase.cpp 2498 1 UserInterface
Error 57 error C2601: 'CInstanceBase::GetWeaponType' : local function definitions are illegal C:\Users\Marian\Desktop\server\Serverfiles bun 2k19\Aureva2 SRC BIN\source\UserInterface\InstanceBase.cpp 2656 1 UserInterface
Error 34 error C2601: 'CInstanceBase::GetVirtualNumber' : local function definitions are illegal C:\Users\Marian\Desktop\server\Serverfiles bun 2k19\Aureva2 SRC BIN\source\UserInterface\InstanceBase.cpp 2473 1 UserInterface
Error 33 error C2601: 'CInstanceBase::GetVirtualID' : local function definitions are illegal C:\Users\Marian\Desktop\server\Serverfiles bun 2k19\Aureva2 SRC BIN\source\UserInterface\InstanceBase.cpp 2468 1 UserInterface
Error 7 error C2601: 'CInstanceBase::GetRace' : local function definitions are illegal C:\Users\Marian\Desktop\server\Serverfiles bun 2k19\Aureva2 SRC BIN\source\UserInterface\InstanceBase.cpp 2137 1 UserInterface
Error 6 error C2601: 'CInstanceBase::GetNameString' : local function definitions are illegal C:\Users\Marian\Desktop\server\Serverfiles bun 2k19\Aureva2 SRC BIN\source\UserInterface\InstanceBase.cpp 2132 1 UserInterface
Error 32 error C2601: 'CInstanceBase::GetInstanceType' : local function definitions are illegal C:\Users\Marian\Desktop\server\Serverfiles bun 2k19\Aureva2 SRC BIN\source\UserInterface\InstanceBase.cpp 2463 1 UserInterface
Error 41 error C2601: 'CInstanceBase::GetGraphicThingInstanceRef' : local function definitions are illegal C:\Users\Marian\Desktop\server\Serverfiles bun 2k19\Aureva2 SRC BIN\source\UserInterface\InstanceBase.cpp 2527 1 UserInterface
Error 42 error C2601: 'CInstanceBase::GetGraphicThingInstancePtr' : local function definitions are illegal C:\Users\Marian\Desktop\server\Serverfiles bun 2k19\Aureva2 SRC BIN\source\UserInterface\InstanceBase.cpp 2532 1 UserInterface
Error 10 error C2601: 'CInstanceBase::GetDuelMode' : local function definitions are illegal C:\Users\Marian\Desktop\server\Serverfiles bun 2k19\Aureva2 SRC BIN\source\UserInterface\InstanceBase.cpp 2169 1 UserInterface
Error 39 error C2601: 'CInstanceBase::GetDistance' : local function definitions are illegal C:\Users\Marian\Desktop\server\Serverfiles bun 2k19\Aureva2 SRC BIN\source\UserInterface\InstanceBase.cpp 2509 1 UserInterface
Error 40 error C2601: 'CInstanceBase::GetDistance' : local function definitions are illegal C:\Users\Marian\Desktop\server\Serverfiles bun 2k19\Aureva2 SRC BIN\source\UserInterface\InstanceBase.cpp 2516 1 UserInterface
Error 69 error C2601: 'CInstanceBase::DestroyDeviceObjects' : local function definitions are illegal C:\Users\Marian\Desktop\server\Serverfiles bun 2k19\Aureva2 SRC BIN\source\UserInterface\InstanceBase.cpp 3021 1 UserInterface
Error 70 error C2601: 'CInstanceBase::Destroy' : local function definitions are illegal C:\Users\Marian\Desktop\server\Serverfiles bun 2k19\Aureva2 SRC BIN\source\UserInterface\InstanceBase.cpp 3026 1 UserInterface
Error 68 error C2601: 'CInstanceBase::CreateDeviceObjects' : local function definitions are illegal C:\Users\Marian\Desktop\server\Serverfiles bun 2k19\Aureva2 SRC BIN\source\UserInterface\InstanceBase.cpp 3016 1 UserInterface
Error 62 error C2601: 'CInstanceBase::ChangeWeapon' : local function definitions are illegal C:\Users\Marian\Desktop\server\Serverfiles bun 2k19\Aureva2 SRC BIN\source\UserInterface\InstanceBase.cpp 2798 1 UserInterface
Error 54 error C2601: 'CInstanceBase::ChangeHair' : local function definitions are illegal C:\Users\Marian\Desktop\server\Serverfiles bun 2k19\Aureva2 SRC BIN\source\UserInterface\InstanceBase.cpp 2601 1 UserInterface
Error 63 error C2601: 'CInstanceBase::ChangeArmor' : local function definitions are illegal C:\Users\Marian\Desktop\server\Serverfiles bun 2k19\Aureva2 SRC BIN\source\UserInterface\InstanceBase.cpp 2807 1 UserInterface
Error 15 error C2601: 'CInstanceBase::CanViewTargetHP' : local function definitions are illegal C:\Users\Marian\Desktop\server\Serverfiles bun 2k19\Aureva2 SRC BIN\source\UserInterface\InstanceBase.cpp 2320 1 UserInterface
Error 14 error C2601: 'CInstanceBase::CanPickInstance' : local function definitions are illegal C:\Users\Marian\Desktop\server\Serverfiles bun 2k19\Aureva2 SRC BIN\source\UserInterface\InstanceBase.cpp 2290 1 UserInterface
Error 13 error C2601: 'CInstanceBase::CanChangeTarget' : local function definitions are illegal C:\Users\Marian\Desktop\server\Serverfiles bun 2k19\Aureva2 SRC BIN\source\UserInterface\InstanceBase.cpp 2284 1 UserInterface
Error 72 error C2601: 'CInstanceBase::__Warrior_Initialize' : local function definitions are illegal C:\Users\Marian\Desktop\server\Serverfiles bun 2k19\Aureva2 SRC BIN\source\UserInterface\InstanceBase.cpp 3050 1 UserInterface
Error 50 error C2601: 'CInstanceBase::__SetBlendRenderingMode' : local function definitions are illegal C:\Users\Marian\Desktop\server\Serverfiles bun 2k19\Aureva2 SRC BIN\source\UserInterface\InstanceBase.cpp 2572 1 UserInterface
Error 51 error C2601: 'CInstanceBase::__SetAlphaValue' : local function definitions are illegal C:\Users\Marian\Desktop\server\Serverfiles bun 2k19\Aureva2 SRC BIN\source\UserInterface\InstanceBase.cpp 2577 1 UserInterface
Error 64 error C2601: 'CInstanceBase::__IsShapeAnimalWear' : local function definitions are illegal C:\Users\Marian\Desktop\server\Serverfiles bun 2k19\Aureva2 SRC BIN\source\UserInterface\InstanceBase.cpp 2861 1 UserInterface
Error 35 error C2601: 'CInstanceBase::__IsInViewFrustum' : local function definitions are illegal C:\Users\Marian\Desktop\server\Serverfiles bun 2k19\Aureva2 SRC BIN\source\UserInterface\InstanceBase.cpp 2479 1 UserInterface
Error 71 error C2601: 'CInstanceBase::__InitializeRotationSpeed' : local function definitions are illegal C:\Users\Marian\Desktop\server\Serverfiles bun 2k19\Aureva2 SRC BIN\source\UserInterface\InstanceBase.cpp 3045 1 UserInterface
Error 73 error C2601: 'CInstanceBase::__Initialize' : local function definitions are illegal C:\Users\Marian\Desktop\server\Serverfiles bun 2k19\Aureva2 SRC BIN\source\UserInterface\InstanceBase.cpp 3055 1 UserInterface
Error 60 error C2601: 'CInstanceBase::__GetRefinedEffect' : local function definitions are illegal C:\Users\Marian\Desktop\server\Serverfiles bun 2k19\Aureva2 SRC BIN\source\UserInterface\InstanceBase.cpp 2713 1 UserInterface
Error 65 error C2601: 'CInstanceBase::__GetRaceType' : local function definitions are illegal C:\Users\Marian\Desktop\server\Serverfiles bun 2k19\Aureva2 SRC BIN\source\UserInterface\InstanceBase.cpp 2872 1 UserInterface
Error 52 error C2601: 'CInstanceBase::__GetAlphaValue' : local function definitions are illegal C:\Users\Marian\Desktop\server\Serverfiles bun 2k19\Aureva2 SRC BIN\source\UserInterface\InstanceBase.cpp 2582 1 UserInterface
Error 58 error C2601: 'CInstanceBase::__ClearWeaponRefineEffect' : local function definitions are illegal C:\Users\Marian\Desktop\server\Serverfiles bun 2k19\Aureva2 SRC BIN\source\UserInterface\InstanceBase.cpp 2690 1 UserInterface
Error 59 error C2601: 'CInstanceBase::__ClearArmorRefineEffect' : local function definitions are illegal C:\Users\Marian\Desktop\server\Serverfiles bun 2k19\Aureva2 SRC BIN\source\UserInterface\InstanceBase.cpp 2704 1 UserInterface
Error 36 error C2601: 'CInstanceBase::__CanRender' : local function definitions are illegal C:\Users\Marian\Desktop\server\Serverfiles bun 2k19\Aureva2 SRC BIN\source\UserInterface\InstanceBase.cpp 2484 1 UserInterface
Error 74 error C2143: syntax error : missing '}' before ';' C:\Users\Marian\Desktop\server\Serverfiles bun 2k19\Aureva2 SRC BIN\source\UserInterface\InstanceBase.cpp 3128 1 UserInterface
Error 75 error C2064: term does not evaluate to a function taking 1 arguments C:\Users\Marian\Desktop\server\Serverfiles bun 2k19\Aureva2 SRC BIN\source\UserInterface\InstanceBase.cpp 3128 1 UserInterface
Error 78 error C2039: 'dwLevel' : is not a member of 'packet_update_char' C:\Users\Marian\Desktop\server\Serverfiles bun 2k19\Aureva2 SRC BIN\source\UserInterface\PythonNetworkStreamPhaseGameActor.cpp 232 1 UserInterface
Warning 77 warning C4800: 'BOOL' : forcing value to bool 'true' or 'false' (performance warning) C:\Users\Marian\Desktop\server\Serverfiles bun 2k19\Aureva2 SRC BIN\source\UserInterface\NetworkActorManager.cpp 417 1 UserInterface
Warning 79 warning C4101: 'iSourceSlotIndex' : unreferenced local variable C:\Users\Marian\Desktop\server\Serverfiles bun 2k19\Aureva2 SRC BIN\source\UserInterface\PythonPlayerModule.cpp 763 1 UserInterface
Warning 80 warning C4101: 'iSlotPos' : unreferenced local variable C:\Users\Marian\Desktop\server\Serverfiles bun 2k19\Aureva2 SRC BIN\source\UserInterface\PythonPlayerModule.cpp 978 1 UserInterface
Error 61 error C2601: 'CInstanceBase::SetWeapon' : local function definitions are illegal C:\Users\Marian\Desktop\server\Serverfiles bun 2k19\Aureva2 SRC BIN\source\UserInterface\InstanceBase.cpp 2774 1 UserInterface
Error 4 error C2601: 'CInstanceBase::SetStateFlags' : local function definitions are illegal C:\Users\Marian\Desktop\server\Serverfiles bun 2k19\Aureva2 SRC BIN\source\UserInterface\InstanceBase.cpp 2114 1 UserInterface
Error 56 error C2601: 'CInstanceBase::SetShape' : local function definitions are illegal C:\Users\Marian\Desktop\server\Serverfiles bun 2k19\Aureva2 SRC BIN\source\UserInterface\InstanceBase.cpp 2640 1 UserInterface
Error 48 error C2601: 'CInstanceBase::SetRenderMode' : local function definitions are illegal C:\Users\Marian\Desktop\server\Serverfiles bun 2k19\Aureva2 SRC BIN\source\UserInterface\InstanceBase.cpp 2562 1 UserInterface
Error 1 error C2601: 'CInstanceBase::SetPKMode' : local function definitions are illegal C:\Users\Marian\Desktop\server\Serverfiles bun 2k19\Aureva2 SRC BIN\source\UserInterface\InstanceBase.cpp 2086 1 UserInterface
Error 3 error C2601: 'CInstanceBase::SetPartyMemberFlag' : local function definitions are illegal C:\Users\Marian\Desktop\server\Serverfiles bun 2k19\Aureva2 SRC BIN\source\UserInterface\InstanceBase.cpp 2109 1 UserInterface
Error 47 error C2601: 'CInstanceBase::SetModulateRenderMode' : local function definitions are illegal C:\Users\Marian\Desktop\server\Serverfiles bun 2k19\Aureva2 SRC BIN\source\UserInterface\InstanceBase.cpp 2557 1 UserInterface
Error 2 error C2601: 'CInstanceBase::SetKiller' : local function definitions are illegal C:\Users\Marian\Desktop\server\Serverfiles bun 2k19\Aureva2 SRC BIN\source\UserInterface\InstanceBase.cpp 2100 1 UserInterface
Error 53 error C2601: 'CInstanceBase::SetHair' : local function definitions are illegal C:\Users\Marian\Desktop\server\Serverfiles bun 2k19\Aureva2 SRC BIN\source\UserInterface\InstanceBase.cpp 2590 1 UserInterface
Error 9 error C2601: 'CInstanceBase::SetDuelMode' : local function definitions are illegal C:\Users\Marian\Desktop\server\Serverfiles bun 2k19\Aureva2 SRC BIN\source\UserInterface\InstanceBase.cpp 2164 1 UserInterface
Error 5 error C2601: 'CInstanceBase::SetComboType' : local function definitions are illegal C:\Users\Marian\Desktop\server\Serverfiles bun 2k19\Aureva2 SRC BIN\source\UserInterface\InstanceBase.cpp 2127 1 UserInterface
Error 55 error C2601: 'CInstanceBase::SetArmor' : local function definitions are illegal C:\Users\Marian\Desktop\server\Serverfiles bun 2k19\Aureva2 SRC BIN\source\UserInterface\InstanceBase.cpp 2620 1 UserInterface
Error 46 error C2601: 'CInstanceBase::SetAddRenderMode' : local function definitions are illegal C:\Users\Marian\Desktop\server\Serverfiles bun 2k19\Aureva2 SRC BIN\source\UserInterface\InstanceBase.cpp 2552 1 UserInterface
Error 49 error C2601: 'CInstanceBase::SetAddColor' : local function definitions are illegal C:\Users\Marian\Desktop\server\Serverfiles bun 2k19\Aureva2 SRC BIN\source\UserInterface\InstanceBase.cpp 2567 1 UserInterface
Error 45 error C2601: 'CInstanceBase::RestoreRenderMode' : local function definitions are illegal C:\Users\Marian\Desktop\server\Serverfiles bun 2k19\Aureva2 SRC BIN\source\UserInterface\InstanceBase.cpp 2547 1 UserInterface
Error 67 error C2601: 'CInstanceBase::RegisterBoundingSphere' : local function definitions are illegal C:\Users\Marian\Desktop\server\Serverfiles bun 2k19\Aureva2 SRC BIN\source\UserInterface\InstanceBase.cpp 3003 1 UserInterface
Error 66 error C2601: 'CInstanceBase::RefreshState' : local function definitions are illegal C:\Users\Marian\Desktop\server\Serverfiles bun 2k19\Aureva2 SRC BIN\source\UserInterface\InstanceBase.cpp 2878 1 UserInterface
Error 43 error C2601: 'CInstanceBase::RefreshActorInstance' : local function definitions are illegal C:\Users\Marian\Desktop\server\Serverfiles bun 2k19\Aureva2 SRC BIN\source\UserInterface\InstanceBase.cpp 2537 1 UserInterface
Error 44 error C2601: 'CInstanceBase::Refresh' : local function definitions are illegal C:\Users\Marian\Desktop\server\Serverfiles bun 2k19\Aureva2 SRC BIN\source\UserInterface\InstanceBase.cpp 2542 1 UserInterface
Error 28 error C2601: 'CInstanceBase::IsWoodenDoor' : local function definitions are illegal C:\Users\Marian\Desktop\server\Serverfiles bun 2k19\Aureva2 SRC BIN\source\UserInterface\InstanceBase.cpp 2417 1 UserInterface
Error 23 error C2601: 'CInstanceBase::IsWarp' : local function definitions are illegal C:\Users\Marian\Desktop\server\Serverfiles bun 2k19\Aureva2 SRC BIN\source\UserInterface\InstanceBase.cpp 2392 1 UserInterface
Error 12 error C2601: 'CInstanceBase::IsTargetableInstance' : local function definitions are illegal C:\Users\Marian\Desktop\server\Serverfiles bun 2k19\Aureva2 SRC BIN\source\UserInterface\InstanceBase.cpp 2278 1 UserInterface
Error 29 error C2601: 'CInstanceBase::IsStoneDoor' : local function definitions are illegal C:\Users\Marian\Desktop\server\Serverfiles bun 2k19\Aureva2 SRC BIN\source\UserInterface\InstanceBase.cpp 2435 1 UserInterface
Error 20 error C2601: 'CInstanceBase::IsStone' : local function definitions are illegal C:\Users\Marian\Desktop\server\Serverfiles bun 2k19\Aureva2 SRC BIN\source\UserInterface\InstanceBase.cpp 2352 1 UserInterface
Error 22 error C2601: 'CInstanceBase::IsResource' : local function definitions are illegal C:\Users\Marian\Desktop\server\Serverfiles bun 2k19\Aureva2 SRC BIN\source\UserInterface\InstanceBase.cpp 2364 1 UserInterface
Error 16 error C2601: 'CInstanceBase::IsPoly' : local function definitions are illegal C:\Users\Marian\Desktop\server\Serverfiles bun 2k19\Aureva2 SRC BIN\source\UserInterface\InstanceBase.cpp 2332 1 UserInterface
Error 17 error C2601: 'CInstanceBase::IsPC' : local function definitions are illegal C:\Users\Marian\Desktop\server\Serverfiles bun 2k19\Aureva2 SRC BIN\source\UserInterface\InstanceBase.cpp 2337 1 UserInterface
Error 25 error C2601: 'CInstanceBase::IsObject' : local function definitions are illegal C:\Users\Marian\Desktop\server\Serverfiles bun 2k19\Aureva2 SRC BIN\source\UserInterface\InstanceBase.cpp 2402 1 UserInterface
Error 18 error C2601: 'CInstanceBase::IsNPC' : local function definitions are illegal C:\Users\Marian\Desktop\server\Serverfiles bun 2k19\Aureva2 SRC BIN\source\UserInterface\InstanceBase.cpp 2342 1 UserInterface
Error 21 error C2601: 'CInstanceBase::IsGuildWall' : local function definitions are illegal C:\Users\Marian\Desktop\server\Serverfiles bun 2k19\Aureva2 SRC BIN\source\UserInterface\InstanceBase.cpp 2358 1 UserInterface
Error 24 error C2601: 'CInstanceBase::IsGoto' : local function definitions are illegal C:\Users\Marian\Desktop\server\Serverfiles bun 2k19\Aureva2 SRC BIN\source\UserInterface\InstanceBase.cpp 2397 1 UserInterface
Error 31 error C2601: 'CInstanceBase::IsForceVisible' : local function definitions are illegal C:\Users\Marian\Desktop\server\Serverfiles bun 2k19\Aureva2 SRC BIN\source\UserInterface\InstanceBase.cpp 2452 1 UserInterface
Error 30 error C2601: 'CInstanceBase::IsFlag' : local function definitions are illegal C:\Users\Marian\Desktop\server\Serverfiles bun 2k19\Aureva2 SRC BIN\source\UserInterface\InstanceBase.cpp 2440 1 UserInterface
Error 19 error C2601: 'CInstanceBase::IsEnemy' : local function definitions are illegal C:\Users\Marian\Desktop\server\Serverfiles bun 2k19\Aureva2 SRC BIN\source\UserInterface\InstanceBase.cpp 2347 1 UserInterface
Error 27 error C2601: 'CInstanceBase::IsDoor' : local function definitions are illegal C:\Users\Marian\Desktop\server\Serverfiles bun 2k19\Aureva2 SRC BIN\source\UserInterface\InstanceBase.cpp 2412 1 UserInterface
Error 8 error C2601: 'CInstanceBase::IsConflictAlignmentInstance' : local function definitions are illegal C:\Users\Marian\Desktop\server\Serverfiles bun 2k19\Aureva2 SRC BIN\source\UserInterface\InstanceBase.cpp 2143 1 UserInterface
Error 26 error C2601: 'CInstanceBase::IsBuilding' : local function definitions are illegal C:\Users\Marian\Desktop\server\Serverfiles bun 2k19\Aureva2 SRC BIN\source\UserInterface\InstanceBase.cpp 2407 1 UserInterface
Error 11 error C2601: 'CInstanceBase::IsAttackableInstance' : local function definitions are illegal C:\Users\Marian\Desktop\server\Serverfiles bun 2k19\Aureva2 SRC BIN\source\UserInterface\InstanceBase.cpp 2174 1 UserInterface
Error 38 error C2601: 'CInstanceBase::IntersectDefendingSphere' : local function definitions are illegal C:\Users\Marian\Desktop\server\Serverfiles bun 2k19\Aureva2 SRC BIN\source\UserInterface\InstanceBase.cpp 2504 1 UserInterface
Error 37 error C2601: 'CInstanceBase::IntersectBoundingBox' : local function definitions are illegal C:\Users\Marian\Desktop\server\Serverfiles bun 2k19\Aureva2 SRC BIN\source\UserInterface\InstanceBase.cpp 2498 1 UserInterface
Error 57 error C2601: 'CInstanceBase::GetWeaponType' : local function definitions are illegal C:\Users\Marian\Desktop\server\Serverfiles bun 2k19\Aureva2 SRC BIN\source\UserInterface\InstanceBase.cpp 2656 1 UserInterface
Error 34 error C2601: 'CInstanceBase::GetVirtualNumber' : local function definitions are illegal C:\Users\Marian\Desktop\server\Serverfiles bun 2k19\Aureva2 SRC BIN\source\UserInterface\InstanceBase.cpp 2473 1 UserInterface
Error 33 error C2601: 'CInstanceBase::GetVirtualID' : local function definitions are illegal C:\Users\Marian\Desktop\server\Serverfiles bun 2k19\Aureva2 SRC BIN\source\UserInterface\InstanceBase.cpp 2468 1 UserInterface
Error 7 error C2601: 'CInstanceBase::GetRace' : local function definitions are illegal C:\Users\Marian\Desktop\server\Serverfiles bun 2k19\Aureva2 SRC BIN\source\UserInterface\InstanceBase.cpp 2137 1 UserInterface
Error 6 error C2601: 'CInstanceBase::GetNameString' : local function definitions are illegal C:\Users\Marian\Desktop\server\Serverfiles bun 2k19\Aureva2 SRC BIN\source\UserInterface\InstanceBase.cpp 2132 1 UserInterface
Error 32 error C2601: 'CInstanceBase::GetInstanceType' : local function definitions are illegal C:\Users\Marian\Desktop\server\Serverfiles bun 2k19\Aureva2 SRC BIN\source\UserInterface\InstanceBase.cpp 2463 1 UserInterface
Error 41 error C2601: 'CInstanceBase::GetGraphicThingInstanceRef' : local function definitions are illegal C:\Users\Marian\Desktop\server\Serverfiles bun 2k19\Aureva2 SRC BIN\source\UserInterface\InstanceBase.cpp 2527 1 UserInterface
Error 42 error C2601: 'CInstanceBase::GetGraphicThingInstancePtr' : local function definitions are illegal C:\Users\Marian\Desktop\server\Serverfiles bun 2k19\Aureva2 SRC BIN\source\UserInterface\InstanceBase.cpp 2532 1 UserInterface
Error 10 error C2601: 'CInstanceBase::GetDuelMode' : local function definitions are illegal C:\Users\Marian\Desktop\server\Serverfiles bun 2k19\Aureva2 SRC BIN\source\UserInterface\InstanceBase.cpp 2169 1 UserInterface
Error 39 error C2601: 'CInstanceBase::GetDistance' : local function definitions are illegal C:\Users\Marian\Desktop\server\Serverfiles bun 2k19\Aureva2 SRC BIN\source\UserInterface\InstanceBase.cpp 2509 1 UserInterface
Error 40 error C2601: 'CInstanceBase::GetDistance' : local function definitions are illegal C:\Users\Marian\Desktop\server\Serverfiles bun 2k19\Aureva2 SRC BIN\source\UserInterface\InstanceBase.cpp 2516 1 UserInterface
Error 69 error C2601: 'CInstanceBase::DestroyDeviceObjects' : local function definitions are illegal C:\Users\Marian\Desktop\server\Serverfiles bun 2k19\Aureva2 SRC BIN\source\UserInterface\InstanceBase.cpp 3021 1 UserInterface
Error 70 error C2601: 'CInstanceBase::Destroy' : local function definitions are illegal C:\Users\Marian\Desktop\server\Serverfiles bun 2k19\Aureva2 SRC BIN\source\UserInterface\InstanceBase.cpp 3026 1 UserInterface
Error 68 error C2601: 'CInstanceBase::CreateDeviceObjects' : local function definitions are illegal C:\Users\Marian\Desktop\server\Serverfiles bun 2k19\Aureva2 SRC BIN\source\UserInterface\InstanceBase.cpp 3016 1 UserInterface
Error 62 error C2601: 'CInstanceBase::ChangeWeapon' : local function definitions are illegal C:\Users\Marian\Desktop\server\Serverfiles bun 2k19\Aureva2 SRC BIN\source\UserInterface\InstanceBase.cpp 2798 1 UserInterface
Error 54 error C2601: 'CInstanceBase::ChangeHair' : local function definitions are illegal C:\Users\Marian\Desktop\server\Serverfiles bun 2k19\Aureva2 SRC BIN\source\UserInterface\InstanceBase.cpp 2601 1 UserInterface
Error 63 error C2601: 'CInstanceBase::ChangeArmor' : local function definitions are illegal C:\Users\Marian\Desktop\server\Serverfiles bun 2k19\Aureva2 SRC BIN\source\UserInterface\InstanceBase.cpp 2807 1 UserInterface
Error 15 error C2601: 'CInstanceBase::CanViewTargetHP' : local function definitions are illegal C:\Users\Marian\Desktop\server\Serverfiles bun 2k19\Aureva2 SRC BIN\source\UserInterface\InstanceBase.cpp 2320 1 UserInterface
Error 14 error C2601: 'CInstanceBase::CanPickInstance' : local function definitions are illegal C:\Users\Marian\Desktop\server\Serverfiles bun 2k19\Aureva2 SRC BIN\source\UserInterface\InstanceBase.cpp 2290 1 UserInterface
Error 13 error C2601: 'CInstanceBase::CanChangeTarget' : local function definitions are illegal C:\Users\Marian\Desktop\server\Serverfiles bun 2k19\Aureva2 SRC BIN\source\UserInterface\InstanceBase.cpp 2284 1 UserInterface
Error 72 error C2601: 'CInstanceBase::__Warrior_Initialize' : local function definitions are illegal C:\Users\Marian\Desktop\server\Serverfiles bun 2k19\Aureva2 SRC BIN\source\UserInterface\InstanceBase.cpp 3050 1 UserInterface
Error 50 error C2601: 'CInstanceBase::__SetBlendRenderingMode' : local function definitions are illegal C:\Users\Marian\Desktop\server\Serverfiles bun 2k19\Aureva2 SRC BIN\source\UserInterface\InstanceBase.cpp 2572 1 UserInterface
Error 51 error C2601: 'CInstanceBase::__SetAlphaValue' : local function definitions are illegal C:\Users\Marian\Desktop\server\Serverfiles bun 2k19\Aureva2 SRC BIN\source\UserInterface\InstanceBase.cpp 2577 1 UserInterface
Error 64 error C2601: 'CInstanceBase::__IsShapeAnimalWear' : local function definitions are illegal C:\Users\Marian\Desktop\server\Serverfiles bun 2k19\Aureva2 SRC BIN\source\UserInterface\InstanceBase.cpp 2861 1 UserInterface
Error 35 error C2601: 'CInstanceBase::__IsInViewFrustum' : local function definitions are illegal C:\Users\Marian\Desktop\server\Serverfiles bun 2k19\Aureva2 SRC BIN\source\UserInterface\InstanceBase.cpp 2479 1 UserInterface
Error 71 error C2601: 'CInstanceBase::__InitializeRotationSpeed' : local function definitions are illegal C:\Users\Marian\Desktop\server\Serverfiles bun 2k19\Aureva2 SRC BIN\source\UserInterface\InstanceBase.cpp 3045 1 UserInterface
Error 73 error C2601: 'CInstanceBase::__Initialize' : local function definitions are illegal C:\Users\Marian\Desktop\server\Serverfiles bun 2k19\Aureva2 SRC BIN\source\UserInterface\InstanceBase.cpp 3055 1 UserInterface
Error 60 error C2601: 'CInstanceBase::__GetRefinedEffect' : local function definitions are illegal C:\Users\Marian\Desktop\server\Serverfiles bun 2k19\Aureva2 SRC BIN\source\UserInterface\InstanceBase.cpp 2713 1 UserInterface
Error 65 error C2601: 'CInstanceBase::__GetRaceType' : local function definitions are illegal C:\Users\Marian\Desktop\server\Serverfiles bun 2k19\Aureva2 SRC BIN\source\UserInterface\InstanceBase.cpp 2872 1 UserInterface
Error 52 error C2601: 'CInstanceBase::__GetAlphaValue' : local function definitions are illegal C:\Users\Marian\Desktop\server\Serverfiles bun 2k19\Aureva2 SRC BIN\source\UserInterface\InstanceBase.cpp 2582 1 UserInterface
Error 58 error C2601: 'CInstanceBase::__ClearWeaponRefineEffect' : local function definitions are illegal C:\Users\Marian\Desktop\server\Serverfiles bun 2k19\Aureva2 SRC BIN\source\UserInterface\InstanceBase.cpp 2690 1 UserInterface
Error 59 error C2601: 'CInstanceBase::__ClearArmorRefineEffect' : local function definitions are illegal C:\Users\Marian\Desktop\server\Serverfiles bun 2k19\Aureva2 SRC BIN\source\UserInterface\InstanceBase.cpp 2704 1 UserInterface
Error 36 error C2601: 'CInstanceBase::__CanRender' : local function definitions are illegal C:\Users\Marian\Desktop\server\Serverfiles bun 2k19\Aureva2 SRC BIN\source\UserInterface\InstanceBase.cpp 2484 1 UserInterface
Error 74 error C2143: syntax error : missing '}' before ';' C:\Users\Marian\Desktop\server\Serverfiles bun 2k19\Aureva2 SRC BIN\source\UserInterface\InstanceBase.cpp 3128 1 UserInterface
Error 75 error C2064: term does not evaluate to a function taking 1 arguments C:\Users\Marian\Desktop\server\Serverfiles bun 2k19\Aureva2 SRC BIN\source\UserInterface\InstanceBase.cpp 3128 1 UserInterface
Error 78 error C2039: 'dwLevel' : is not a member of 'packet_update_char' C:\Users\Marian\Desktop\server\Serverfiles bun 2k19\Aureva2 SRC BIN\source\UserInterface\PythonNetworkStreamPhaseGameActor.cpp 232 1 UserInterface
*Detalii suplimentare:
2>------ Build started: Project: CWebBrowser, Configuration: Distribute Win32 ------
3>------ Build started: Project: EffectLib, Configuration: Distribute Win32 ------
4>------ Build started: Project: EterBase, Configuration: Distribute Win32 ------
2> CWebBrowser.vcxproj -> C:\Users\Marian\Desktop\server\Serverfiles bun 2k19\Aureva2 SRC BIN\vs_files\CWebBrowser\Distribute\CWebBrowser.lib
1> EterLocale.vcxproj -> C:\Users\Marian\Desktop\server\Serverfiles bun 2k19\Aureva2 SRC BIN\vs_files\EterLocale\Distribute\EterLocale.lib
4> EterBase.vcxproj -> C:\Users\Marian\Desktop\server\Serverfiles bun 2k19\Aureva2 SRC BIN\vs_files\EterBase\Distribute\EterBase.lib
3> EffectLib.vcxproj -> C:\Users\Marian\Desktop\server\Serverfiles bun 2k19\Aureva2 SRC BIN\vs_files\EffectLib\Distribute\EffectLib.lib
5>------ Build started: Project: EterGrnLib, Configuration: Distribute Win32 ------
6>------ Build started: Project: EterImageLib, Configuration: Distribute Win32 ------
5> EterGrnLib.vcxproj -> C:\Users\Marian\Desktop\server\Serverfiles bun 2k19\Aureva2 SRC BIN\vs_files\EterGrnLib\Distribute\EterGrnLib.lib
6> EterImageLib.vcxproj -> C:\Users\Marian\Desktop\server\Serverfiles bun 2k19\Aureva2 SRC BIN\vs_files\EterImageLib\Distribute\EterImageLib.lib
7>------ Build started: Project: EterLib, Configuration: Distribute Win32 ------
8>------ Build started: Project: EterPack, Configuration: Distribute Win32 ------
8> EterPack.vcxproj -> C:\Users\Marian\Desktop\server\Serverfiles bun 2k19\Aureva2 SRC BIN\vs_files\EterPack\Distribute\EterPack.lib
9>------ Build started: Project: EterPythonLib, Configuration: Distribute Win32 ------
7> EterLib.vcxproj -> C:\Users\Marian\Desktop\server\Serverfiles bun 2k19\Aureva2 SRC BIN\vs_files\EterLib\Distribute\EterLib.lib
10>------ Build started: Project: GameLib, Configuration: Distribute Win32 ------
11>------ Build started: Project: MilesLib, Configuration: Distribute Win32 ------
9> EterPythonLib.vcxproj -> C:\Users\Marian\Desktop\server\Serverfiles bun 2k19\Aureva2 SRC BIN\vs_files\EterPythonLib\Distribute\EterPythonLib.lib
10> GameLib.vcxproj -> C:\Users\Marian\Desktop\server\Serverfiles bun 2k19\Aureva2 SRC BIN\vs_files\GameLib\Distribute\GameLib.lib
12>------ Build started: Project: PRTerrainLib, Configuration: Distribute Win32 ------
11> MilesLib.vcxproj -> C:\Users\Marian\Desktop\server\Serverfiles bun 2k19\Aureva2 SRC BIN\vs_files\MilesLib\Distribute\MilesLib.lib
12> TerrainLib.vcxproj -> C:\Users\Marian\Desktop\server\Serverfiles bun 2k19\Aureva2 SRC BIN\vs_files\TerrainLib\Distribute\PRTerrainLib.lib
13>------ Build started: Project: ScriptLib, Configuration: Distribute Win32 ------
14>------ Build started: Project: SpeedTreeLib, Configuration: Distribute Win32 ------
15>------ Build started: Project: SphereLib, Configuration: Distribute Win32 ------
13> ScriptLib.vcxproj -> C:\Users\Marian\Desktop\server\Serverfiles bun 2k19\Aureva2 SRC BIN\vs_files\ScriptLib\Distribute\ScriptLib.lib
14> SpeedTreeLib.vcxproj -> C:\Users\Marian\Desktop\server\Serverfiles bun 2k19\Aureva2 SRC BIN\vs_files\SpeedTreeLib\Distribute\SpeedTreeLib.lib
15> SphereLib.vcxproj -> C:\Users\Marian\Desktop\server\Serverfiles bun 2k19\Aureva2 SRC BIN\vs_files\SphereLib\Distribute\SphereLib.lib
16>------ Build started: Project: UserInterface, Configuration: Distribute Win32 ------
16> StdAfx.cpp
16> AccountConnector.cpp
16> AffectFlagContainer.cpp
16> CameraProcedure.cpp
16> CheckLatestFiles.cpp
16> GameType.cpp
16> GuildMarkDownloader.cpp
16> GuildMarkUploader.cpp
16> HackShield.cpp
16> InstanceBase.cpp
16>..\..\source\UserInterface\InstanceBase.cpp(2086): error C2601: 'CInstanceBase::SetPKMode' : local function definitions are illegal
16> ..\..\source\UserInterface\InstanceBase.cpp(2081): this line contains a '{' which has not yet been matched
16>..\..\source\UserInterface\InstanceBase.cpp(2100): error C2601: 'CInstanceBase::SetKiller' : local function definitions are illegal
16> ..\..\source\UserInterface\InstanceBase.cpp(2081): this line contains a '{' which has not yet been matched
16>..\..\source\UserInterface\InstanceBase.cpp(2109): error C2601: 'CInstanceBase::SetPartyMemberFlag' : local function definitions are illegal
16> ..\..\source\UserInterface\InstanceBase.cpp(2081): this line contains a '{' which has not yet been matched
16>..\..\source\UserInterface\InstanceBase.cpp(2114): error C2601: 'CInstanceBase::SetStateFlags' : local function definitions are illegal
16> ..\..\source\UserInterface\InstanceBase.cpp(2081): this line contains a '{' which has not yet been matched
16>..\..\source\UserInterface\InstanceBase.cpp(2127): error C2601: 'CInstanceBase::SetComboType' : local function definitions are illegal
16> ..\..\source\UserInterface\InstanceBase.cpp(2081): this line contains a '{' which has not yet been matched
16>..\..\source\UserInterface\InstanceBase.cpp(2132): error C2601: 'CInstanceBase::GetNameString' : local function definitions are illegal
16> ..\..\source\UserInterface\InstanceBase.cpp(2081): this line contains a '{' which has not yet been matched
16>..\..\source\UserInterface\InstanceBase.cpp(2137): error C2601: 'CInstanceBase::GetRace' : local function definitions are illegal
16> ..\..\source\UserInterface\InstanceBase.cpp(2081): this line contains a '{' which has not yet been matched
16>..\..\source\UserInterface\InstanceBase.cpp(2143): error C2601: 'CInstanceBase::IsConflictAlignmentInstance' : local function definitions are illegal
16> ..\..\source\UserInterface\InstanceBase.cpp(2081): this line contains a '{' which has not yet been matched
16>..\..\source\UserInterface\InstanceBase.cpp(2164): error C2601: 'CInstanceBase::SetDuelMode' : local function definitions are illegal
16> ..\..\source\UserInterface\InstanceBase.cpp(2081): this line contains a '{' which has not yet been matched
16>..\..\source\UserInterface\InstanceBase.cpp(2169): error C2601: 'CInstanceBase::GetDuelMode' : local function definitions are illegal
16> ..\..\source\UserInterface\InstanceBase.cpp(2081): this line contains a '{' which has not yet been matched
16>..\..\source\UserInterface\InstanceBase.cpp(2174): error C2601: 'CInstanceBase::IsAttackableInstance' : local function definitions are illegal
16> ..\..\source\UserInterface\InstanceBase.cpp(2081): this line contains a '{' which has not yet been matched
16>..\..\source\UserInterface\InstanceBase.cpp(2278): error C2601: 'CInstanceBase::IsTargetableInstance' : local function definitions are illegal
16> ..\..\source\UserInterface\InstanceBase.cpp(2081): this line contains a '{' which has not yet been matched
16>..\..\source\UserInterface\InstanceBase.cpp(2284): error C2601: 'CInstanceBase::CanChangeTarget' : local function definitions are illegal
16> ..\..\source\UserInterface\InstanceBase.cpp(2081): this line contains a '{' which has not yet been matched
16>..\..\source\UserInterface\InstanceBase.cpp(2290): error C2601: 'CInstanceBase::CanPickInstance' : local function definitions are illegal
16> ..\..\source\UserInterface\InstanceBase.cpp(2081): this line contains a '{' which has not yet been matched
16>..\..\source\UserInterface\InstanceBase.cpp(2320): error C2601: 'CInstanceBase::CanViewTargetHP' : local function definitions are illegal
16> ..\..\source\UserInterface\InstanceBase.cpp(2081): this line contains a '{' which has not yet been matched
16>..\..\source\UserInterface\InstanceBase.cpp(2332): error C2601: 'CInstanceBase::IsPoly' : local function definitions are illegal
16> ..\..\source\UserInterface\InstanceBase.cpp(2081): this line contains a '{' which has not yet been matched
16>..\..\source\UserInterface\InstanceBase.cpp(2337): error C2601: 'CInstanceBase::IsPC' : local function definitions are illegal
16> ..\..\source\UserInterface\InstanceBase.cpp(2081): this line contains a '{' which has not yet been matched
16>..\..\source\UserInterface\InstanceBase.cpp(2342): error C2601: 'CInstanceBase::IsNPC' : local function definitions are illegal
16> ..\..\source\UserInterface\InstanceBase.cpp(2081): this line contains a '{' which has not yet been matched
16>..\..\source\UserInterface\InstanceBase.cpp(2347): error C2601: 'CInstanceBase::IsEnemy' : local function definitions are illegal
16> ..\..\source\UserInterface\InstanceBase.cpp(2081): this line contains a '{' which has not yet been matched
16>..\..\source\UserInterface\InstanceBase.cpp(2352): error C2601: 'CInstanceBase::IsStone' : local function definitions are illegal
16> ..\..\source\UserInterface\InstanceBase.cpp(2081): this line contains a '{' which has not yet been matched
16>..\..\source\UserInterface\InstanceBase.cpp(2358): error C2601: 'CInstanceBase::IsGuildWall' : local function definitions are illegal
16> ..\..\source\UserInterface\InstanceBase.cpp(2081): this line contains a '{' which has not yet been matched
16>..\..\source\UserInterface\InstanceBase.cpp(2364): error C2601: 'CInstanceBase::IsResource' : local function definitions are illegal
16> ..\..\source\UserInterface\InstanceBase.cpp(2081): this line contains a '{' which has not yet been matched
16>..\..\source\UserInterface\InstanceBase.cpp(2392): error C2601: 'CInstanceBase::IsWarp' : local function definitions are illegal
16> ..\..\source\UserInterface\InstanceBase.cpp(2081): this line contains a '{' which has not yet been matched
16>..\..\source\UserInterface\InstanceBase.cpp(2397): error C2601: 'CInstanceBase::IsGoto' : local function definitions are illegal
16> ..\..\source\UserInterface\InstanceBase.cpp(2081): this line contains a '{' which has not yet been matched
16>..\..\source\UserInterface\InstanceBase.cpp(2402): error C2601: 'CInstanceBase::IsObject' : local function definitions are illegal
16> ..\..\source\UserInterface\InstanceBase.cpp(2081): this line contains a '{' which has not yet been matched
16>..\..\source\UserInterface\InstanceBase.cpp(2407): error C2601: 'CInstanceBase::IsBuilding' : local function definitions are illegal
16> ..\..\source\UserInterface\InstanceBase.cpp(2081): this line contains a '{' which has not yet been matched
16>..\..\source\UserInterface\InstanceBase.cpp(2412): error C2601: 'CInstanceBase::IsDoor' : local function definitions are illegal
16> ..\..\source\UserInterface\InstanceBase.cpp(2081): this line contains a '{' which has not yet been matched
16>..\..\source\UserInterface\InstanceBase.cpp(2417): error C2601: 'CInstanceBase::IsWoodenDoor' : local function definitions are illegal
16> ..\..\source\UserInterface\InstanceBase.cpp(2081): this line contains a '{' which has not yet been matched
16>..\..\source\UserInterface\InstanceBase.cpp(2435): error C2601: 'CInstanceBase::IsStoneDoor' : local function definitions are illegal
16> ..\..\source\UserInterface\InstanceBase.cpp(2081): this line contains a '{' which has not yet been matched
16>..\..\source\UserInterface\InstanceBase.cpp(2440): error C2601: 'CInstanceBase::IsFlag' : local function definitions are illegal
16> ..\..\source\UserInterface\InstanceBase.cpp(2081): this line contains a '{' which has not yet been matched
16>..\..\source\UserInterface\InstanceBase.cpp(2452): error C2601: 'CInstanceBase::IsForceVisible' : local function definitions are illegal
16> ..\..\source\UserInterface\InstanceBase.cpp(2081): this line contains a '{' which has not yet been matched
16>..\..\source\UserInterface\InstanceBase.cpp(2463): error C2601: 'CInstanceBase::GetInstanceType' : local function definitions are illegal
16> ..\..\source\UserInterface\InstanceBase.cpp(2081): this line contains a '{' which has not yet been matched
16>..\..\source\UserInterface\InstanceBase.cpp(2468): error C2601: 'CInstanceBase::GetVirtualID' : local function definitions are illegal
16> ..\..\source\UserInterface\InstanceBase.cpp(2081): this line contains a '{' which has not yet been matched
16>..\..\source\UserInterface\InstanceBase.cpp(2473): error C2601: 'CInstanceBase::GetVirtualNumber' : local function definitions are illegal
16> ..\..\source\UserInterface\InstanceBase.cpp(2081): this line contains a '{' which has not yet been matched
16>..\..\source\UserInterface\InstanceBase.cpp(2479): error C2601: 'CInstanceBase::__IsInViewFrustum' : local function definitions are illegal
16> ..\..\source\UserInterface\InstanceBase.cpp(2081): this line contains a '{' which has not yet been matched
16>..\..\source\UserInterface\InstanceBase.cpp(2484): error C2601: 'CInstanceBase::__CanRender' : local function definitions are illegal
16> ..\..\source\UserInterface\InstanceBase.cpp(2081): this line contains a '{' which has not yet been matched
16>..\..\source\UserInterface\InstanceBase.cpp(2498): error C2601: 'CInstanceBase::IntersectBoundingBox' : local function definitions are illegal
16> ..\..\source\UserInterface\InstanceBase.cpp(2081): this line contains a '{' which has not yet been matched
16>..\..\source\UserInterface\InstanceBase.cpp(2504): error C2601: 'CInstanceBase::IntersectDefendingSphere' : local function definitions are illegal
16> ..\..\source\UserInterface\InstanceBase.cpp(2081): this line contains a '{' which has not yet been matched
16>..\..\source\UserInterface\InstanceBase.cpp(2509): error C2601: 'CInstanceBase::GetDistance' : local function definitions are illegal
16> ..\..\source\UserInterface\InstanceBase.cpp(2081): this line contains a '{' which has not yet been matched
16>..\..\source\UserInterface\InstanceBase.cpp(2516): error C2601: 'CInstanceBase::GetDistance' : local function definitions are illegal
16> ..\..\source\UserInterface\InstanceBase.cpp(2081): this line contains a '{' which has not yet been matched
16>..\..\source\UserInterface\InstanceBase.cpp(2527): error C2601: 'CInstanceBase::GetGraphicThingInstanceRef' : local function definitions are illegal
16> ..\..\source\UserInterface\InstanceBase.cpp(2081): this line contains a '{' which has not yet been matched
16>..\..\source\UserInterface\InstanceBase.cpp(2532): error C2601: 'CInstanceBase::GetGraphicThingInstancePtr' : local function definitions are illegal
16> ..\..\source\UserInterface\InstanceBase.cpp(2081): this line contains a '{' which has not yet been matched
16>..\..\source\UserInterface\InstanceBase.cpp(2537): error C2601: 'CInstanceBase::RefreshActorInstance' : local function definitions are illegal
16> ..\..\source\UserInterface\InstanceBase.cpp(2081): this line contains a '{' which has not yet been matched
16>..\..\source\UserInterface\InstanceBase.cpp(2542): error C2601: 'CInstanceBase::Refresh' : local function definitions are illegal
16> ..\..\source\UserInterface\InstanceBase.cpp(2081): this line contains a '{' which has not yet been matched
16>..\..\source\UserInterface\InstanceBase.cpp(2547): error C2601: 'CInstanceBase::RestoreRenderMode' : local function definitions are illegal
16> ..\..\source\UserInterface\InstanceBase.cpp(2081): this line contains a '{' which has not yet been matched
16>..\..\source\UserInterface\InstanceBase.cpp(2552): error C2601: 'CInstanceBase::SetAddRenderMode' : local function definitions are illegal
16> ..\..\source\UserInterface\InstanceBase.cpp(2081): this line contains a '{' which has not yet been matched
16>..\..\source\UserInterface\InstanceBase.cpp(2557): error C2601: 'CInstanceBase::SetModulateRenderMode' : local function definitions are illegal
16> ..\..\source\UserInterface\InstanceBase.cpp(2081): this line contains a '{' which has not yet been matched
16>..\..\source\UserInterface\InstanceBase.cpp(2562): error C2601: 'CInstanceBase::SetRenderMode' : local function definitions are illegal
16> ..\..\source\UserInterface\InstanceBase.cpp(2081): this line contains a '{' which has not yet been matched
16>..\..\source\UserInterface\InstanceBase.cpp(2567): error C2601: 'CInstanceBase::SetAddColor' : local function definitions are illegal
16> ..\..\source\UserInterface\InstanceBase.cpp(2081): this line contains a '{' which has not yet been matched
16>..\..\source\UserInterface\InstanceBase.cpp(2572): error C2601: 'CInstanceBase::__SetBlendRenderingMode' : local function definitions are illegal
16> ..\..\source\UserInterface\InstanceBase.cpp(2081): this line contains a '{' which has not yet been matched
16>..\..\source\UserInterface\InstanceBase.cpp(2577): error C2601: 'CInstanceBase::__SetAlphaValue' : local function definitions are illegal
16> ..\..\source\UserInterface\InstanceBase.cpp(2081): this line contains a '{' which has not yet been matched
16>..\..\source\UserInterface\InstanceBase.cpp(2582): error C2601: 'CInstanceBase::__GetAlphaValue' : local function definitions are illegal
16> ..\..\source\UserInterface\InstanceBase.cpp(2081): this line contains a '{' which has not yet been matched
16>..\..\source\UserInterface\InstanceBase.cpp(2590): error C2601: 'CInstanceBase::SetHair' : local function definitions are illegal
16> ..\..\source\UserInterface\InstanceBase.cpp(2081): this line contains a '{' which has not yet been matched
16>..\..\source\UserInterface\InstanceBase.cpp(2601): error C2601: 'CInstanceBase::ChangeHair' : local function definitions are illegal
16> ..\..\source\UserInterface\InstanceBase.cpp(2081): this line contains a '{' which has not yet been matched
16>..\..\source\UserInterface\InstanceBase.cpp(2620): error C2601: 'CInstanceBase::SetArmor' : local function definitions are illegal
16> ..\..\source\UserInterface\InstanceBase.cpp(2081): this line contains a '{' which has not yet been matched
16>..\..\source\UserInterface\InstanceBase.cpp(2640): error C2601: 'CInstanceBase::SetShape' : local function definitions are illegal
16> ..\..\source\UserInterface\InstanceBase.cpp(2081): this line contains a '{' which has not yet been matched
16>..\..\source\UserInterface\InstanceBase.cpp(2656): error C2601: 'CInstanceBase::GetWeaponType' : local function definitions are illegal
16> ..\..\source\UserInterface\InstanceBase.cpp(2081): this line contains a '{' which has not yet been matched
16>..\..\source\UserInterface\InstanceBase.cpp(2690): error C2601: 'CInstanceBase::__ClearWeaponRefineEffect' : local function definitions are illegal
16> ..\..\source\UserInterface\InstanceBase.cpp(2081): this line contains a '{' which has not yet been matched
16>..\..\source\UserInterface\InstanceBase.cpp(2704): error C2601: 'CInstanceBase::__ClearArmorRefineEffect' : local function definitions are illegal
16> ..\..\source\UserInterface\InstanceBase.cpp(2081): this line contains a '{' which has not yet been matched
16>..\..\source\UserInterface\InstanceBase.cpp(2713): error C2601: 'CInstanceBase::__GetRefinedEffect' : local function definitions are illegal
16> ..\..\source\UserInterface\InstanceBase.cpp(2081): this line contains a '{' which has not yet been matched
16>..\..\source\UserInterface\InstanceBase.cpp(2774): error C2601: 'CInstanceBase::SetWeapon' : local function definitions are illegal
16> ..\..\source\UserInterface\InstanceBase.cpp(2081): this line contains a '{' which has not yet been matched
16>..\..\source\UserInterface\InstanceBase.cpp(2798): error C2601: 'CInstanceBase::ChangeWeapon' : local function definitions are illegal
16> ..\..\source\UserInterface\InstanceBase.cpp(2081): this line contains a '{' which has not yet been matched
16>..\..\source\UserInterface\InstanceBase.cpp(2807): error C2601: 'CInstanceBase::ChangeArmor' : local function definitions are illegal
16> ..\..\source\UserInterface\InstanceBase.cpp(2081): this line contains a '{' which has not yet been matched
16>..\..\source\UserInterface\InstanceBase.cpp(2861): error C2601: 'CInstanceBase::__IsShapeAnimalWear' : local function definitions are illegal
16> ..\..\source\UserInterface\InstanceBase.cpp(2081): this line contains a '{' which has not yet been matched
16>..\..\source\UserInterface\InstanceBase.cpp(2872): error C2601: 'CInstanceBase::__GetRaceType' : local function definitions are illegal
16> ..\..\source\UserInterface\InstanceBase.cpp(2081): this line contains a '{' which has not yet been matched
16>..\..\source\UserInterface\InstanceBase.cpp(2878): error C2601: 'CInstanceBase::RefreshState' : local function definitions are illegal
16> ..\..\source\UserInterface\InstanceBase.cpp(2081): this line contains a '{' which has not yet been matched
16>..\..\source\UserInterface\InstanceBase.cpp(3003): error C2601: 'CInstanceBase::RegisterBoundingSphere' : local function definitions are illegal
16> ..\..\source\UserInterface\InstanceBase.cpp(2081): this line contains a '{' which has not yet been matched
16>..\..\source\UserInterface\InstanceBase.cpp(3016): error C2601: 'CInstanceBase::CreateDeviceObjects' : local function definitions are illegal
16> ..\..\source\UserInterface\InstanceBase.cpp(2081): this line contains a '{' which has not yet been matched
16>..\..\source\UserInterface\InstanceBase.cpp(3021): error C2601: 'CInstanceBase::DestroyDeviceObjects' : local function definitions are illegal
16> ..\..\source\UserInterface\InstanceBase.cpp(2081): this line contains a '{' which has not yet been matched
16>..\..\source\UserInterface\InstanceBase.cpp(3026): error C2601: 'CInstanceBase::Destroy' : local function definitions are illegal
16> ..\..\source\UserInterface\InstanceBase.cpp(2081): this line contains a '{' which has not yet been matched
16>..\..\source\UserInterface\InstanceBase.cpp(3045): error C2601: 'CInstanceBase::__InitializeRotationSpeed' : local function definitions are illegal
16> ..\..\source\UserInterface\InstanceBase.cpp(2081): this line contains a '{' which has not yet been matched
16>..\..\source\UserInterface\InstanceBase.cpp(3050): error C2601: 'CInstanceBase::__Warrior_Initialize' : local function definitions are illegal
16> ..\..\source\UserInterface\InstanceBase.cpp(2081): this line contains a '{' which has not yet been matched
16>..\..\source\UserInterface\InstanceBase.cpp(3055): error C2601: 'CInstanceBase::__Initialize' : local function definitions are illegal
16> ..\..\source\UserInterface\InstanceBase.cpp(2081): this line contains a '{' which has not yet been matched
16>..\..\source\UserInterface\InstanceBase.cpp(3128): error C2143: syntax error : missing '}' before ';'
16>..\..\source\UserInterface\InstanceBase.cpp(3128): error C2064: term does not evaluate to a function taking 1 arguments
16> InstanceBaseBattle.cpp
16> InstanceBaseEffect.cpp
16> InstanceBaseEvent.cpp
16> InstanceBaseMotion.cpp
16> InstanceBaseMovement.cpp
16> InstanceBaseTransform.cpp
16> InsultChecker.cpp
16> Locale.cpp
16> MarkImage.cpp
16> MarkManager.cpp
16> MovieMan.cpp
16> Compiling...
16> NProtectGameGuard.cpp
16> NetworkActorManager.cpp
16>..\..\source\UserInterface\NetworkActorManager.cpp(367): warning C4800: 'BOOL' : forcing value to bool 'true' or 'false' (performance warning)
16>..\..\source\UserInterface\NetworkActorManager.cpp(417): warning C4800: 'BOOL' : forcing value to bool 'true' or 'false' (performance warning)
16> ProcessCRC.cpp
16> ProcessScanner.cpp
16> PythonApplication.cpp
16> PythonApplicationCamera.cpp
16> PythonApplicationCursor.cpp
16> PythonApplicationEvent.cpp
16> PythonApplicationLogo.cpp
16> PythonApplicationModule.cpp
16> PythonApplicationProcedure.cpp
16> PythonApplicationWebPage.cpp
16> PythonBackground.cpp
16> PythonBackgroundModule.cpp
16> PythonCharacterManager.cpp
16> PythonCharacterManagerModule.cpp
16> PythonCharacterModule.cpp
16> PythonChat.cpp
16> PythonChatModule.cpp
16> PythonEffectModule.cpp
16> Compiling...
16> PythonEventManager.cpp
16> PythonEventManagerMoudle.cpp
16> PythonExceptionSender.cpp
16> PythonExchange.cpp
16> PythonExchangeModule.cpp
16> PythonFlyModule.cpp
16> PythonGameEventManagerModule.cpp
16> PythonGuild.cpp
16> PythonIME.cpp
16> PythonIMEModule.cpp
16> PythonItem.cpp
16> PythonItemModule.cpp
16> PythonMessenger.cpp
16> PythonMiniMap.cpp
16> PythonMiniMapModule.cpp
16> PythonNetworkDatagram.cpp
16> PythonNetworkDatagramModule.cpp
16> PythonNetworkStream.cpp
16> PythonNetworkStreamCommand.cpp
16> PythonNetworkStreamEvent.cpp
16> Compiling...
16> PythonNetworkStreamModule.cpp
16> PythonNetworkStreamPhaseGame.cpp
16> PythonNetworkStreamPhaseGameActor.cpp
16>..\..\source\UserInterface\PythonNetworkStreamPhaseGameActor.cpp(232): error C2039: 'dwLevel' : is not a member of 'packet_update_char'
16> c:\users\marian\desktop\server\serverfiles bun 2k19\aureva2 src bin\source\userinterface\packet.h(1375) : see declaration of 'packet_update_char'
16> PythonNetworkStreamPhaseGameItem.cpp
16> PythonNetworkStreamPhaseHandShake.cpp
16> PythonNetworkStreamPhaseLoading.cpp
16> PythonNetworkStreamPhaseLogin.cpp
16> PythonNetworkStreamPhaseOffline.cpp
16> PythonNetworkStreamPhaseSelect.cpp
16> PythonNonPlayer.cpp
16> PythonNonPlayerModule.cpp
16> PythonPackModule.cpp
16> PythonPlayer.cpp
16> PythonPlayerEventHandler.cpp
16> PythonPlayerInput.cpp
16> PythonPlayerInputKeyboard.cpp
16> PythonPlayerInputMouse.cpp
16> PythonPlayerModule.cpp
16>..\..\source\UserInterface\PythonPlayerModule.cpp(763): warning C4101: 'iSourceSlotIndex' : unreferenced local variable
16>..\..\source\UserInterface\PythonPlayerModule.cpp(978): warning C4101: 'iSlotPos' : unreferenced local variable
16> PythonPlayerSkill.cpp
16> PythonProfilerModule.cpp
16> Compiling...
16> PythonQuest.cpp
16> PythonSafeBox.cpp
16> PythonShop.cpp
16> PythonSkill.cpp
16> PythonSoundManagerModule.cpp
16> PythonSystem.cpp
16> PythonSystemModule.cpp
16> PythonTextTail.cpp
16> PythonTextTailModule.cpp
16> ServerStateChecker.cpp
16> ServerStateCheckerModule.cpp
16> UserInterface.cpp
16> WiseLogicXTrap.cpp
========== Build: 15 succeeded, 1 failed, 0 up-to-date, 0 skipped ==========
3>------ Build started: Project: EffectLib, Configuration: Distribute Win32 ------
4>------ Build started: Project: EterBase, Configuration: Distribute Win32 ------
2> CWebBrowser.vcxproj -> C:\Users\Marian\Desktop\server\Serverfiles bun 2k19\Aureva2 SRC BIN\vs_files\CWebBrowser\Distribute\CWebBrowser.lib
1> EterLocale.vcxproj -> C:\Users\Marian\Desktop\server\Serverfiles bun 2k19\Aureva2 SRC BIN\vs_files\EterLocale\Distribute\EterLocale.lib
4> EterBase.vcxproj -> C:\Users\Marian\Desktop\server\Serverfiles bun 2k19\Aureva2 SRC BIN\vs_files\EterBase\Distribute\EterBase.lib
3> EffectLib.vcxproj -> C:\Users\Marian\Desktop\server\Serverfiles bun 2k19\Aureva2 SRC BIN\vs_files\EffectLib\Distribute\EffectLib.lib
5>------ Build started: Project: EterGrnLib, Configuration: Distribute Win32 ------
6>------ Build started: Project: EterImageLib, Configuration: Distribute Win32 ------
5> EterGrnLib.vcxproj -> C:\Users\Marian\Desktop\server\Serverfiles bun 2k19\Aureva2 SRC BIN\vs_files\EterGrnLib\Distribute\EterGrnLib.lib
6> EterImageLib.vcxproj -> C:\Users\Marian\Desktop\server\Serverfiles bun 2k19\Aureva2 SRC BIN\vs_files\EterImageLib\Distribute\EterImageLib.lib
7>------ Build started: Project: EterLib, Configuration: Distribute Win32 ------
8>------ Build started: Project: EterPack, Configuration: Distribute Win32 ------
8> EterPack.vcxproj -> C:\Users\Marian\Desktop\server\Serverfiles bun 2k19\Aureva2 SRC BIN\vs_files\EterPack\Distribute\EterPack.lib
9>------ Build started: Project: EterPythonLib, Configuration: Distribute Win32 ------
7> EterLib.vcxproj -> C:\Users\Marian\Desktop\server\Serverfiles bun 2k19\Aureva2 SRC BIN\vs_files\EterLib\Distribute\EterLib.lib
10>------ Build started: Project: GameLib, Configuration: Distribute Win32 ------
11>------ Build started: Project: MilesLib, Configuration: Distribute Win32 ------
9> EterPythonLib.vcxproj -> C:\Users\Marian\Desktop\server\Serverfiles bun 2k19\Aureva2 SRC BIN\vs_files\EterPythonLib\Distribute\EterPythonLib.lib
10> GameLib.vcxproj -> C:\Users\Marian\Desktop\server\Serverfiles bun 2k19\Aureva2 SRC BIN\vs_files\GameLib\Distribute\GameLib.lib
12>------ Build started: Project: PRTerrainLib, Configuration: Distribute Win32 ------
11> MilesLib.vcxproj -> C:\Users\Marian\Desktop\server\Serverfiles bun 2k19\Aureva2 SRC BIN\vs_files\MilesLib\Distribute\MilesLib.lib
12> TerrainLib.vcxproj -> C:\Users\Marian\Desktop\server\Serverfiles bun 2k19\Aureva2 SRC BIN\vs_files\TerrainLib\Distribute\PRTerrainLib.lib
13>------ Build started: Project: ScriptLib, Configuration: Distribute Win32 ------
14>------ Build started: Project: SpeedTreeLib, Configuration: Distribute Win32 ------
15>------ Build started: Project: SphereLib, Configuration: Distribute Win32 ------
13> ScriptLib.vcxproj -> C:\Users\Marian\Desktop\server\Serverfiles bun 2k19\Aureva2 SRC BIN\vs_files\ScriptLib\Distribute\ScriptLib.lib
14> SpeedTreeLib.vcxproj -> C:\Users\Marian\Desktop\server\Serverfiles bun 2k19\Aureva2 SRC BIN\vs_files\SpeedTreeLib\Distribute\SpeedTreeLib.lib
15> SphereLib.vcxproj -> C:\Users\Marian\Desktop\server\Serverfiles bun 2k19\Aureva2 SRC BIN\vs_files\SphereLib\Distribute\SphereLib.lib
16>------ Build started: Project: UserInterface, Configuration: Distribute Win32 ------
16> StdAfx.cpp
16> AccountConnector.cpp
16> AffectFlagContainer.cpp
16> CameraProcedure.cpp
16> CheckLatestFiles.cpp
16> GameType.cpp
16> GuildMarkDownloader.cpp
16> GuildMarkUploader.cpp
16> HackShield.cpp
16> InstanceBase.cpp
16>..\..\source\UserInterface\InstanceBase.cpp(2086): error C2601: 'CInstanceBase::SetPKMode' : local function definitions are illegal
16> ..\..\source\UserInterface\InstanceBase.cpp(2081): this line contains a '{' which has not yet been matched
16>..\..\source\UserInterface\InstanceBase.cpp(2100): error C2601: 'CInstanceBase::SetKiller' : local function definitions are illegal
16> ..\..\source\UserInterface\InstanceBase.cpp(2081): this line contains a '{' which has not yet been matched
16>..\..\source\UserInterface\InstanceBase.cpp(2109): error C2601: 'CInstanceBase::SetPartyMemberFlag' : local function definitions are illegal
16> ..\..\source\UserInterface\InstanceBase.cpp(2081): this line contains a '{' which has not yet been matched
16>..\..\source\UserInterface\InstanceBase.cpp(2114): error C2601: 'CInstanceBase::SetStateFlags' : local function definitions are illegal
16> ..\..\source\UserInterface\InstanceBase.cpp(2081): this line contains a '{' which has not yet been matched
16>..\..\source\UserInterface\InstanceBase.cpp(2127): error C2601: 'CInstanceBase::SetComboType' : local function definitions are illegal
16> ..\..\source\UserInterface\InstanceBase.cpp(2081): this line contains a '{' which has not yet been matched
16>..\..\source\UserInterface\InstanceBase.cpp(2132): error C2601: 'CInstanceBase::GetNameString' : local function definitions are illegal
16> ..\..\source\UserInterface\InstanceBase.cpp(2081): this line contains a '{' which has not yet been matched
16>..\..\source\UserInterface\InstanceBase.cpp(2137): error C2601: 'CInstanceBase::GetRace' : local function definitions are illegal
16> ..\..\source\UserInterface\InstanceBase.cpp(2081): this line contains a '{' which has not yet been matched
16>..\..\source\UserInterface\InstanceBase.cpp(2143): error C2601: 'CInstanceBase::IsConflictAlignmentInstance' : local function definitions are illegal
16> ..\..\source\UserInterface\InstanceBase.cpp(2081): this line contains a '{' which has not yet been matched
16>..\..\source\UserInterface\InstanceBase.cpp(2164): error C2601: 'CInstanceBase::SetDuelMode' : local function definitions are illegal
16> ..\..\source\UserInterface\InstanceBase.cpp(2081): this line contains a '{' which has not yet been matched
16>..\..\source\UserInterface\InstanceBase.cpp(2169): error C2601: 'CInstanceBase::GetDuelMode' : local function definitions are illegal
16> ..\..\source\UserInterface\InstanceBase.cpp(2081): this line contains a '{' which has not yet been matched
16>..\..\source\UserInterface\InstanceBase.cpp(2174): error C2601: 'CInstanceBase::IsAttackableInstance' : local function definitions are illegal
16> ..\..\source\UserInterface\InstanceBase.cpp(2081): this line contains a '{' which has not yet been matched
16>..\..\source\UserInterface\InstanceBase.cpp(2278): error C2601: 'CInstanceBase::IsTargetableInstance' : local function definitions are illegal
16> ..\..\source\UserInterface\InstanceBase.cpp(2081): this line contains a '{' which has not yet been matched
16>..\..\source\UserInterface\InstanceBase.cpp(2284): error C2601: 'CInstanceBase::CanChangeTarget' : local function definitions are illegal
16> ..\..\source\UserInterface\InstanceBase.cpp(2081): this line contains a '{' which has not yet been matched
16>..\..\source\UserInterface\InstanceBase.cpp(2290): error C2601: 'CInstanceBase::CanPickInstance' : local function definitions are illegal
16> ..\..\source\UserInterface\InstanceBase.cpp(2081): this line contains a '{' which has not yet been matched
16>..\..\source\UserInterface\InstanceBase.cpp(2320): error C2601: 'CInstanceBase::CanViewTargetHP' : local function definitions are illegal
16> ..\..\source\UserInterface\InstanceBase.cpp(2081): this line contains a '{' which has not yet been matched
16>..\..\source\UserInterface\InstanceBase.cpp(2332): error C2601: 'CInstanceBase::IsPoly' : local function definitions are illegal
16> ..\..\source\UserInterface\InstanceBase.cpp(2081): this line contains a '{' which has not yet been matched
16>..\..\source\UserInterface\InstanceBase.cpp(2337): error C2601: 'CInstanceBase::IsPC' : local function definitions are illegal
16> ..\..\source\UserInterface\InstanceBase.cpp(2081): this line contains a '{' which has not yet been matched
16>..\..\source\UserInterface\InstanceBase.cpp(2342): error C2601: 'CInstanceBase::IsNPC' : local function definitions are illegal
16> ..\..\source\UserInterface\InstanceBase.cpp(2081): this line contains a '{' which has not yet been matched
16>..\..\source\UserInterface\InstanceBase.cpp(2347): error C2601: 'CInstanceBase::IsEnemy' : local function definitions are illegal
16> ..\..\source\UserInterface\InstanceBase.cpp(2081): this line contains a '{' which has not yet been matched
16>..\..\source\UserInterface\InstanceBase.cpp(2352): error C2601: 'CInstanceBase::IsStone' : local function definitions are illegal
16> ..\..\source\UserInterface\InstanceBase.cpp(2081): this line contains a '{' which has not yet been matched
16>..\..\source\UserInterface\InstanceBase.cpp(2358): error C2601: 'CInstanceBase::IsGuildWall' : local function definitions are illegal
16> ..\..\source\UserInterface\InstanceBase.cpp(2081): this line contains a '{' which has not yet been matched
16>..\..\source\UserInterface\InstanceBase.cpp(2364): error C2601: 'CInstanceBase::IsResource' : local function definitions are illegal
16> ..\..\source\UserInterface\InstanceBase.cpp(2081): this line contains a '{' which has not yet been matched
16>..\..\source\UserInterface\InstanceBase.cpp(2392): error C2601: 'CInstanceBase::IsWarp' : local function definitions are illegal
16> ..\..\source\UserInterface\InstanceBase.cpp(2081): this line contains a '{' which has not yet been matched
16>..\..\source\UserInterface\InstanceBase.cpp(2397): error C2601: 'CInstanceBase::IsGoto' : local function definitions are illegal
16> ..\..\source\UserInterface\InstanceBase.cpp(2081): this line contains a '{' which has not yet been matched
16>..\..\source\UserInterface\InstanceBase.cpp(2402): error C2601: 'CInstanceBase::IsObject' : local function definitions are illegal
16> ..\..\source\UserInterface\InstanceBase.cpp(2081): this line contains a '{' which has not yet been matched
16>..\..\source\UserInterface\InstanceBase.cpp(2407): error C2601: 'CInstanceBase::IsBuilding' : local function definitions are illegal
16> ..\..\source\UserInterface\InstanceBase.cpp(2081): this line contains a '{' which has not yet been matched
16>..\..\source\UserInterface\InstanceBase.cpp(2412): error C2601: 'CInstanceBase::IsDoor' : local function definitions are illegal
16> ..\..\source\UserInterface\InstanceBase.cpp(2081): this line contains a '{' which has not yet been matched
16>..\..\source\UserInterface\InstanceBase.cpp(2417): error C2601: 'CInstanceBase::IsWoodenDoor' : local function definitions are illegal
16> ..\..\source\UserInterface\InstanceBase.cpp(2081): this line contains a '{' which has not yet been matched
16>..\..\source\UserInterface\InstanceBase.cpp(2435): error C2601: 'CInstanceBase::IsStoneDoor' : local function definitions are illegal
16> ..\..\source\UserInterface\InstanceBase.cpp(2081): this line contains a '{' which has not yet been matched
16>..\..\source\UserInterface\InstanceBase.cpp(2440): error C2601: 'CInstanceBase::IsFlag' : local function definitions are illegal
16> ..\..\source\UserInterface\InstanceBase.cpp(2081): this line contains a '{' which has not yet been matched
16>..\..\source\UserInterface\InstanceBase.cpp(2452): error C2601: 'CInstanceBase::IsForceVisible' : local function definitions are illegal
16> ..\..\source\UserInterface\InstanceBase.cpp(2081): this line contains a '{' which has not yet been matched
16>..\..\source\UserInterface\InstanceBase.cpp(2463): error C2601: 'CInstanceBase::GetInstanceType' : local function definitions are illegal
16> ..\..\source\UserInterface\InstanceBase.cpp(2081): this line contains a '{' which has not yet been matched
16>..\..\source\UserInterface\InstanceBase.cpp(2468): error C2601: 'CInstanceBase::GetVirtualID' : local function definitions are illegal
16> ..\..\source\UserInterface\InstanceBase.cpp(2081): this line contains a '{' which has not yet been matched
16>..\..\source\UserInterface\InstanceBase.cpp(2473): error C2601: 'CInstanceBase::GetVirtualNumber' : local function definitions are illegal
16> ..\..\source\UserInterface\InstanceBase.cpp(2081): this line contains a '{' which has not yet been matched
16>..\..\source\UserInterface\InstanceBase.cpp(2479): error C2601: 'CInstanceBase::__IsInViewFrustum' : local function definitions are illegal
16> ..\..\source\UserInterface\InstanceBase.cpp(2081): this line contains a '{' which has not yet been matched
16>..\..\source\UserInterface\InstanceBase.cpp(2484): error C2601: 'CInstanceBase::__CanRender' : local function definitions are illegal
16> ..\..\source\UserInterface\InstanceBase.cpp(2081): this line contains a '{' which has not yet been matched
16>..\..\source\UserInterface\InstanceBase.cpp(2498): error C2601: 'CInstanceBase::IntersectBoundingBox' : local function definitions are illegal
16> ..\..\source\UserInterface\InstanceBase.cpp(2081): this line contains a '{' which has not yet been matched
16>..\..\source\UserInterface\InstanceBase.cpp(2504): error C2601: 'CInstanceBase::IntersectDefendingSphere' : local function definitions are illegal
16> ..\..\source\UserInterface\InstanceBase.cpp(2081): this line contains a '{' which has not yet been matched
16>..\..\source\UserInterface\InstanceBase.cpp(2509): error C2601: 'CInstanceBase::GetDistance' : local function definitions are illegal
16> ..\..\source\UserInterface\InstanceBase.cpp(2081): this line contains a '{' which has not yet been matched
16>..\..\source\UserInterface\InstanceBase.cpp(2516): error C2601: 'CInstanceBase::GetDistance' : local function definitions are illegal
16> ..\..\source\UserInterface\InstanceBase.cpp(2081): this line contains a '{' which has not yet been matched
16>..\..\source\UserInterface\InstanceBase.cpp(2527): error C2601: 'CInstanceBase::GetGraphicThingInstanceRef' : local function definitions are illegal
16> ..\..\source\UserInterface\InstanceBase.cpp(2081): this line contains a '{' which has not yet been matched
16>..\..\source\UserInterface\InstanceBase.cpp(2532): error C2601: 'CInstanceBase::GetGraphicThingInstancePtr' : local function definitions are illegal
16> ..\..\source\UserInterface\InstanceBase.cpp(2081): this line contains a '{' which has not yet been matched
16>..\..\source\UserInterface\InstanceBase.cpp(2537): error C2601: 'CInstanceBase::RefreshActorInstance' : local function definitions are illegal
16> ..\..\source\UserInterface\InstanceBase.cpp(2081): this line contains a '{' which has not yet been matched
16>..\..\source\UserInterface\InstanceBase.cpp(2542): error C2601: 'CInstanceBase::Refresh' : local function definitions are illegal
16> ..\..\source\UserInterface\InstanceBase.cpp(2081): this line contains a '{' which has not yet been matched
16>..\..\source\UserInterface\InstanceBase.cpp(2547): error C2601: 'CInstanceBase::RestoreRenderMode' : local function definitions are illegal
16> ..\..\source\UserInterface\InstanceBase.cpp(2081): this line contains a '{' which has not yet been matched
16>..\..\source\UserInterface\InstanceBase.cpp(2552): error C2601: 'CInstanceBase::SetAddRenderMode' : local function definitions are illegal
16> ..\..\source\UserInterface\InstanceBase.cpp(2081): this line contains a '{' which has not yet been matched
16>..\..\source\UserInterface\InstanceBase.cpp(2557): error C2601: 'CInstanceBase::SetModulateRenderMode' : local function definitions are illegal
16> ..\..\source\UserInterface\InstanceBase.cpp(2081): this line contains a '{' which has not yet been matched
16>..\..\source\UserInterface\InstanceBase.cpp(2562): error C2601: 'CInstanceBase::SetRenderMode' : local function definitions are illegal
16> ..\..\source\UserInterface\InstanceBase.cpp(2081): this line contains a '{' which has not yet been matched
16>..\..\source\UserInterface\InstanceBase.cpp(2567): error C2601: 'CInstanceBase::SetAddColor' : local function definitions are illegal
16> ..\..\source\UserInterface\InstanceBase.cpp(2081): this line contains a '{' which has not yet been matched
16>..\..\source\UserInterface\InstanceBase.cpp(2572): error C2601: 'CInstanceBase::__SetBlendRenderingMode' : local function definitions are illegal
16> ..\..\source\UserInterface\InstanceBase.cpp(2081): this line contains a '{' which has not yet been matched
16>..\..\source\UserInterface\InstanceBase.cpp(2577): error C2601: 'CInstanceBase::__SetAlphaValue' : local function definitions are illegal
16> ..\..\source\UserInterface\InstanceBase.cpp(2081): this line contains a '{' which has not yet been matched
16>..\..\source\UserInterface\InstanceBase.cpp(2582): error C2601: 'CInstanceBase::__GetAlphaValue' : local function definitions are illegal
16> ..\..\source\UserInterface\InstanceBase.cpp(2081): this line contains a '{' which has not yet been matched
16>..\..\source\UserInterface\InstanceBase.cpp(2590): error C2601: 'CInstanceBase::SetHair' : local function definitions are illegal
16> ..\..\source\UserInterface\InstanceBase.cpp(2081): this line contains a '{' which has not yet been matched
16>..\..\source\UserInterface\InstanceBase.cpp(2601): error C2601: 'CInstanceBase::ChangeHair' : local function definitions are illegal
16> ..\..\source\UserInterface\InstanceBase.cpp(2081): this line contains a '{' which has not yet been matched
16>..\..\source\UserInterface\InstanceBase.cpp(2620): error C2601: 'CInstanceBase::SetArmor' : local function definitions are illegal
16> ..\..\source\UserInterface\InstanceBase.cpp(2081): this line contains a '{' which has not yet been matched
16>..\..\source\UserInterface\InstanceBase.cpp(2640): error C2601: 'CInstanceBase::SetShape' : local function definitions are illegal
16> ..\..\source\UserInterface\InstanceBase.cpp(2081): this line contains a '{' which has not yet been matched
16>..\..\source\UserInterface\InstanceBase.cpp(2656): error C2601: 'CInstanceBase::GetWeaponType' : local function definitions are illegal
16> ..\..\source\UserInterface\InstanceBase.cpp(2081): this line contains a '{' which has not yet been matched
16>..\..\source\UserInterface\InstanceBase.cpp(2690): error C2601: 'CInstanceBase::__ClearWeaponRefineEffect' : local function definitions are illegal
16> ..\..\source\UserInterface\InstanceBase.cpp(2081): this line contains a '{' which has not yet been matched
16>..\..\source\UserInterface\InstanceBase.cpp(2704): error C2601: 'CInstanceBase::__ClearArmorRefineEffect' : local function definitions are illegal
16> ..\..\source\UserInterface\InstanceBase.cpp(2081): this line contains a '{' which has not yet been matched
16>..\..\source\UserInterface\InstanceBase.cpp(2713): error C2601: 'CInstanceBase::__GetRefinedEffect' : local function definitions are illegal
16> ..\..\source\UserInterface\InstanceBase.cpp(2081): this line contains a '{' which has not yet been matched
16>..\..\source\UserInterface\InstanceBase.cpp(2774): error C2601: 'CInstanceBase::SetWeapon' : local function definitions are illegal
16> ..\..\source\UserInterface\InstanceBase.cpp(2081): this line contains a '{' which has not yet been matched
16>..\..\source\UserInterface\InstanceBase.cpp(2798): error C2601: 'CInstanceBase::ChangeWeapon' : local function definitions are illegal
16> ..\..\source\UserInterface\InstanceBase.cpp(2081): this line contains a '{' which has not yet been matched
16>..\..\source\UserInterface\InstanceBase.cpp(2807): error C2601: 'CInstanceBase::ChangeArmor' : local function definitions are illegal
16> ..\..\source\UserInterface\InstanceBase.cpp(2081): this line contains a '{' which has not yet been matched
16>..\..\source\UserInterface\InstanceBase.cpp(2861): error C2601: 'CInstanceBase::__IsShapeAnimalWear' : local function definitions are illegal
16> ..\..\source\UserInterface\InstanceBase.cpp(2081): this line contains a '{' which has not yet been matched
16>..\..\source\UserInterface\InstanceBase.cpp(2872): error C2601: 'CInstanceBase::__GetRaceType' : local function definitions are illegal
16> ..\..\source\UserInterface\InstanceBase.cpp(2081): this line contains a '{' which has not yet been matched
16>..\..\source\UserInterface\InstanceBase.cpp(2878): error C2601: 'CInstanceBase::RefreshState' : local function definitions are illegal
16> ..\..\source\UserInterface\InstanceBase.cpp(2081): this line contains a '{' which has not yet been matched
16>..\..\source\UserInterface\InstanceBase.cpp(3003): error C2601: 'CInstanceBase::RegisterBoundingSphere' : local function definitions are illegal
16> ..\..\source\UserInterface\InstanceBase.cpp(2081): this line contains a '{' which has not yet been matched
16>..\..\source\UserInterface\InstanceBase.cpp(3016): error C2601: 'CInstanceBase::CreateDeviceObjects' : local function definitions are illegal
16> ..\..\source\UserInterface\InstanceBase.cpp(2081): this line contains a '{' which has not yet been matched
16>..\..\source\UserInterface\InstanceBase.cpp(3021): error C2601: 'CInstanceBase::DestroyDeviceObjects' : local function definitions are illegal
16> ..\..\source\UserInterface\InstanceBase.cpp(2081): this line contains a '{' which has not yet been matched
16>..\..\source\UserInterface\InstanceBase.cpp(3026): error C2601: 'CInstanceBase::Destroy' : local function definitions are illegal
16> ..\..\source\UserInterface\InstanceBase.cpp(2081): this line contains a '{' which has not yet been matched
16>..\..\source\UserInterface\InstanceBase.cpp(3045): error C2601: 'CInstanceBase::__InitializeRotationSpeed' : local function definitions are illegal
16> ..\..\source\UserInterface\InstanceBase.cpp(2081): this line contains a '{' which has not yet been matched
16>..\..\source\UserInterface\InstanceBase.cpp(3050): error C2601: 'CInstanceBase::__Warrior_Initialize' : local function definitions are illegal
16> ..\..\source\UserInterface\InstanceBase.cpp(2081): this line contains a '{' which has not yet been matched
16>..\..\source\UserInterface\InstanceBase.cpp(3055): error C2601: 'CInstanceBase::__Initialize' : local function definitions are illegal
16> ..\..\source\UserInterface\InstanceBase.cpp(2081): this line contains a '{' which has not yet been matched
16>..\..\source\UserInterface\InstanceBase.cpp(3128): error C2143: syntax error : missing '}' before ';'
16>..\..\source\UserInterface\InstanceBase.cpp(3128): error C2064: term does not evaluate to a function taking 1 arguments
16> InstanceBaseBattle.cpp
16> InstanceBaseEffect.cpp
16> InstanceBaseEvent.cpp
16> InstanceBaseMotion.cpp
16> InstanceBaseMovement.cpp
16> InstanceBaseTransform.cpp
16> InsultChecker.cpp
16> Locale.cpp
16> MarkImage.cpp
16> MarkManager.cpp
16> MovieMan.cpp
16> Compiling...
16> NProtectGameGuard.cpp
16> NetworkActorManager.cpp
16>..\..\source\UserInterface\NetworkActorManager.cpp(367): warning C4800: 'BOOL' : forcing value to bool 'true' or 'false' (performance warning)
16>..\..\source\UserInterface\NetworkActorManager.cpp(417): warning C4800: 'BOOL' : forcing value to bool 'true' or 'false' (performance warning)
16> ProcessCRC.cpp
16> ProcessScanner.cpp
16> PythonApplication.cpp
16> PythonApplicationCamera.cpp
16> PythonApplicationCursor.cpp
16> PythonApplicationEvent.cpp
16> PythonApplicationLogo.cpp
16> PythonApplicationModule.cpp
16> PythonApplicationProcedure.cpp
16> PythonApplicationWebPage.cpp
16> PythonBackground.cpp
16> PythonBackgroundModule.cpp
16> PythonCharacterManager.cpp
16> PythonCharacterManagerModule.cpp
16> PythonCharacterModule.cpp
16> PythonChat.cpp
16> PythonChatModule.cpp
16> PythonEffectModule.cpp
16> Compiling...
16> PythonEventManager.cpp
16> PythonEventManagerMoudle.cpp
16> PythonExceptionSender.cpp
16> PythonExchange.cpp
16> PythonExchangeModule.cpp
16> PythonFlyModule.cpp
16> PythonGameEventManagerModule.cpp
16> PythonGuild.cpp
16> PythonIME.cpp
16> PythonIMEModule.cpp
16> PythonItem.cpp
16> PythonItemModule.cpp
16> PythonMessenger.cpp
16> PythonMiniMap.cpp
16> PythonMiniMapModule.cpp
16> PythonNetworkDatagram.cpp
16> PythonNetworkDatagramModule.cpp
16> PythonNetworkStream.cpp
16> PythonNetworkStreamCommand.cpp
16> PythonNetworkStreamEvent.cpp
16> Compiling...
16> PythonNetworkStreamModule.cpp
16> PythonNetworkStreamPhaseGame.cpp
16> PythonNetworkStreamPhaseGameActor.cpp
16>..\..\source\UserInterface\PythonNetworkStreamPhaseGameActor.cpp(232): error C2039: 'dwLevel' : is not a member of 'packet_update_char'
16> c:\users\marian\desktop\server\serverfiles bun 2k19\aureva2 src bin\source\userinterface\packet.h(1375) : see declaration of 'packet_update_char'
16> PythonNetworkStreamPhaseGameItem.cpp
16> PythonNetworkStreamPhaseHandShake.cpp
16> PythonNetworkStreamPhaseLoading.cpp
16> PythonNetworkStreamPhaseLogin.cpp
16> PythonNetworkStreamPhaseOffline.cpp
16> PythonNetworkStreamPhaseSelect.cpp
16> PythonNonPlayer.cpp
16> PythonNonPlayerModule.cpp
16> PythonPackModule.cpp
16> PythonPlayer.cpp
16> PythonPlayerEventHandler.cpp
16> PythonPlayerInput.cpp
16> PythonPlayerInputKeyboard.cpp
16> PythonPlayerInputMouse.cpp
16> PythonPlayerModule.cpp
16>..\..\source\UserInterface\PythonPlayerModule.cpp(763): warning C4101: 'iSourceSlotIndex' : unreferenced local variable
16>..\..\source\UserInterface\PythonPlayerModule.cpp(978): warning C4101: 'iSlotPos' : unreferenced local variable
16> PythonPlayerSkill.cpp
16> PythonProfilerModule.cpp
16> Compiling...
16> PythonQuest.cpp
16> PythonSafeBox.cpp
16> PythonShop.cpp
16> PythonSkill.cpp
16> PythonSoundManagerModule.cpp
16> PythonSystem.cpp
16> PythonSystemModule.cpp
16> PythonTextTail.cpp
16> PythonTextTailModule.cpp
16> ServerStateChecker.cpp
16> ServerStateCheckerModule.cpp
16> UserInterface.cpp
16> WiseLogicXTrap.cpp
========== Build: 15 succeeded, 1 failed, 0 up-to-date, 0 skipped ==========





