Problema compilare pythonskillpets

Totalitatea subiectelor care nu respectă regulamentul impus in sectiunea "Probleme şi Întrebări" vor fi stocate aici.
Închis
Avatar utilizator
darkallience3
Nivel 6

Nivel 6
Mesaje: 952
Membru din: 17 Dec 2013, 15:03
Server: Metin2Andromeda
Regat: Jinno
Aprecieri: 294  
Mulţumiri: 183  
Medalii

Mă poate ajuta și pe mine cineva cu aceste errori ?

16> PythonSkillPet.cpp
16>PythonSkillPet.cpp(5): error C2653: 'PythonSkillPet' : is not a class or namespace name
16>PythonSkillPet.cpp(6): error C4430: missing type specifier - int assumed. Note: C++ does not support default-int
16>PythonSkillPet.cpp(7): warning C4508: 'PythonSkillPet' : function should return a value; 'void' return type assumed
16>PythonSkillPet.cpp(10): error C2653: 'PythonSkillPet' : is not a class or namespace name
16>PythonSkillPet.cpp(10): fatal error C1903: unable to recover from previous error(s); stopping compilation
========== Rebuild All: 15 succeeded, 1 failed, 0 skipped ==========
Afișează semnătura
Avatar utilizator
- edward.
Nivel 5

Nivel 5
Mesaje: 879
Membru din: 08 Sep 2017, 20:53
Server: lucrez la un 2089m
Regat: Chunjo
Aprecieri: 13  
Mulţumiri: 34  
Medalii

ţi-am mai arhivat un subiect pentru că nu ai model, ţi-l arhivez şi pe ăsta.
Imagine
detalii despre serviciile tehnice oferite de mine găseşti aici.


mr digei ediţă - radio dev j4m
Afișează semnătura
Închis
Răspunsuri
7
Vizualizări
706
Răspunsuri
1
Vizualizări
88
Răspunsuri
2
Vizualizări
329

Înapoi la “Arhivă Probleme şi Întrebări”

  • Informaţie
  • Cine este conectat

    Utilizatori ce ce navighează pe acest forum: Niciun utilizator înregistrat și 33 vizitatori