skypeMoț scrie:Moț#2948alin96zah scrie:il am eu til dau daca ma ajuti sal fac sa compilez sa mearga totMoț scrie:care mai are link-urile, va dau fixurile.
[FULL]Serverfiles clean - Undyne
fi mai explicit te rogoneX scrie:Probabil nu are upp de la boostqalin96zah scrie:nu pot compila sursa am instalat acele pkg pe host free bsd 11. si nu merge
[ Postat de pe Android ]
- CjMt2
-

- Mesaje: 291
- Membru din: 20 Sep 2014, 07:01
- Server: CjMt2
- Regat: Shinsoo
- Aprecieri: 18
- Mulţumiri: 22
- Discord: Copiază ID
- Contact:
Tare cred ca si aceste file ajung langa celelalte gunoaie prezentate drept file de server.
Asa se incheie compilarea game:
In alta ordine de idei in Makefile la db este linia:
CUM ERA CU BSD CLEAN SI CELE CATEVA PACHETE DIN PORTURI INSTALATE?
db nu se compileaza pentru ca:
M-am apucat de acest server, astept sa vad ce face la compilare si pun PUBLICA masina virtuala pe care lucrez, cu toate filele incluse.
Asa se incheie compilarea game:
Cod: Selectaţi tot
In file included from ./DragonLair.h:4:
./../../stl.h:96:32: error: expected ')'
template <typename T> T MIN(T a, T b)
^
./../../stl.h:96:26: note: to match this '('
template <typename T> T MIN(T a, T b)
^
/usr/include/sys/param.h:303:20: note: expanded from macro 'MIN'
#define MIN(a,b) (((a)<(b))?(a):(b))
^
In file included from DragonLair.cpp:4:
In file included from ./DragonLair.h:4:
./../../stl.h:96:26: error: expected ')'
template <typename T> T MIN(T a, T b)
^
/usr/include/sys/param.h:303:23: note: expanded from macro 'MIN'
#define MIN(a,b) (((a)<(b))?(a):(b))
^
./../../stl.h:96:26: note: to match this '('
/usr/include/sys/param.h:303:19: note: expanded from macro 'MIN'
#define MIN(a,b) (((a)<(b))?(a):(b))
^
In file included from DragonLair.cpp:4:
In file included from ./DragonLair.h:4:
./../../stl.h:96:26: error: expected ')'
template <typename T> T MIN(T a, T b)
^
/usr/include/sys/param.h:303:28: note: expanded from macro 'MIN'
#define MIN(a,b) (((a)<(b))?(a):(b))
^
./../../stl.h:96:26: note: to match this '('
/usr/include/sys/param.h:303:18: note: expanded from macro 'MIN'
#define MIN(a,b) (((a)<(b))?(a):(b))
^
In file included from DragonLair.cpp:4:
In file included from ./DragonLair.h:4:
./../../stl.h:98:3: error: expected expression
return a < b ? a : b;
^
./../../stl.h:99:3: error: expected ';' at end of declaration
}
^
;
./../../stl.h:101:32: error: expected ')'
template <typename T> T MAX(T a, T b)
^
./../../stl.h:101:26: note: to match this '('
template <typename T> T MAX(T a, T b)
^
/usr/include/sys/param.h:304:20: note: expanded from macro 'MAX'
#define MAX(a,b) (((a)>(b))?(a):(b))
^
In file included from DragonLair.cpp:4:
In file included from ./DragonLair.h:4:
./../../stl.h:101:26: error: expected ')'
template <typename T> T MAX(T a, T b)
^
/usr/include/sys/param.h:304:23: note: expanded from macro 'MAX'
#define MAX(a,b) (((a)>(b))?(a):(b))
^
./../../stl.h:101:26: note: to match this '('
/usr/include/sys/param.h:304:19: note: expanded from macro 'MAX'
#define MAX(a,b) (((a)>(b))?(a):(b))
^
In file included from DragonLair.cpp:4:
In file included from ./DragonLair.h:4:
./../../stl.h:101:26: error: expected ')'
template <typename T> T MAX(T a, T b)
^
/usr/include/sys/param.h:304:28: note: expanded from macro 'MAX'
#define MAX(a,b) (((a)>(b))?(a):(b))
^
./../../stl.h:101:26: note: to match this '('
/usr/include/sys/param.h:304:18: note: expanded from macro 'MAX'
#define MAX(a,b) (((a)>(b))?(a):(b))
^
In file included from DragonLair.cpp:4:
In file included from ./DragonLair.h:4:
./../../stl.h:101:30: error: redefinition of 'T'
template <typename T> T MAX(T a, T b)
^
./../../stl.h:96:30: note: previous definition is here
template <typename T> T MIN(T a, T b)
^
./../../stl.h:103:3: error: expected expression
return a > b ? a : b;
^
./../../stl.h:104:3: error: expected ';' at end of declaration
}
^
;
11 errors generated.
gmake: *** [Makefile:77: debug/DragonLair.o] Error 1
Cod: Selectaţi tot
CLINKFLAGS_DBG = ... /usr/local/lib32/metin2 db nu se compileaza pentru ca:
Cod: Selectaţi tot
g -I/usr/local/include -I../../../Internal -I/usr/local/include/mysql -D__SVN_VERSION__="70220" -c ClientManagerEventFlag.cpp -o debug/ClientManagerEventFlag.o
ClientManagerEventFlag.cpp:13:7: error: no member named 'auto_ptr' in namespace 'std'
std::auto_ptr<SQLMsg> pmsg(CDBManager::instance().DirectQuery(szQuery));
~~~~~^
ClientManagerEventFlag.cpp:13:16: error: unexpected type name 'SQLMsg': expected expression
std::auto_ptr<SQLMsg> pmsg(CDBManager::instance().DirectQuery(szQuery));
^
ClientManagerEventFlag.cpp:13:24: error: use of undeclared identifier 'pmsg'
std::auto_ptr<SQLMsg> pmsg(CDBManager::instance().DirectQuery(szQuery));
^
ClientManagerEventFlag.cpp:15:20: error: use of undeclared identifier 'pmsg'
SQLResult* pRes = pmsg->Get();
^
4 errors generated.
gmake: *** [Makefile:55: debug/ClientManagerEventFlag.o] Error 1
Trebuie instalate pkg-urile date pe prima pagina fiecare separat.. dupa refacute makeurile , sursele , etc.. si dupa iti zic eu ca este unul dintre cele mai stabile sf-uri .. insa este foarte clean.. client 240mb.. eu am lucrat pe el.. este full client server 650mb.. deci spor sa ai .. la mine a durat 1 saptamana jumate sal fac.. ca nu stiu c++ asa bine 
-
- Informaţie
-
Cine este conectat
Utilizatori ce ce navighează pe acest forum: Niciun utilizator înregistrat și 5 vizitatori






