Tipologie server:-
*Resursă folosită:Server File Play-Now
*ServerFiles utilizat:Play-Now
*Syserr:
Cod: Selectaţi tot
1>------ Build started: Project: EffectLib, Configuration: Release Win32 ------
2>------ Build started: Project: EterPack, Configuration: Release Win32 ------
2> EterPack.cpp
2>c:\users\admin\desktop\src-client\eterbase\filename.h(236): warning C4996: 'strcpy': This function or variable may be unsafe. Consider using strcpy_s instead. To disable deprecation, use _CRT_SECURE_NO_WARNINGS. See online help for details.
2> C:\Program Files (x86)\Microsoft Visual Studio 12.0\VC\include\string.h(112) : see declaration of 'strcpy'
2>c:\users\admin\desktop\src-client\eterpack\EterPack.h(5): fatal error C1083: Cannot open include file: 'boost/unordered_map.hpp': No such file or directory
2> EterPackCursor.cpp
2>c:\users\admin\desktop\src-client\eterbase\filename.h(236): warning C4996: 'strcpy': This function or variable may be unsafe. Consider using strcpy_s instead. To disable deprecation, use _CRT_SECURE_NO_WARNINGS. See online help for details.
2> C:\Program Files (x86)\Microsoft Visual Studio 12.0\VC\include\string.h(112) : see declaration of 'strcpy'
2>c:\users\admin\desktop\src-client\eterpack\EterPack.h(5): fatal error C1083: Cannot open include file: 'boost/unordered_map.hpp': No such file or directory
2> EterPackManager.cpp
2>c:\users\admin\desktop\src-client\eterbase\filename.h(236): warning C4996: 'strcpy': This function or variable may be unsafe. Consider using strcpy_s instead. To disable deprecation, use _CRT_SECURE_NO_WARNINGS. See online help for details.
2> C:\Program Files (x86)\Microsoft Visual Studio 12.0\VC\include\string.h(112) : see declaration of 'strcpy'
2>c:\users\admin\desktop\src-client\eterpack\EterPackManager.h(4): fatal error C1083: Cannot open include file: 'boost/unordered_map.hpp': No such file or directory
2> EterPackPolicy_CSHybridCrypt.cpp
2>c:\users\admin\desktop\src-client\eterbase\filename.h(236): warning C4996: 'strcpy': This function or variable may be unsafe. Consider using strcpy_s instead. To disable deprecation, use _CRT_SECURE_NO_WARNINGS. See online help for details.
2> C:\Program Files (x86)\Microsoft Visual Studio 12.0\VC\include\string.h(112) : see declaration of 'strcpy'
2>c:\users\admin\desktop\src-client\eterpack\EterPackPolicy_CSHybridCrypt.h(4): fatal error C1083: Cannot open include file: 'boost/unordered_map.hpp': No such file or directory
2> Generating Code...
3>------ Build started: Project: PRTerrainLib, Configuration: Release Win32 ------
3> StdAfx.cpp
3>c:\users\admin\desktop\src-client\prterrainlib\../EterLib/StdAfx.h(23): fatal error C1083: Cannot open include file: 'd3d8.h': No such file or directory
4>------ Build started: Project: SpeedTreeLib, Configuration: Release Win32 ------
4> StdAfx.cpp
4>c:\users\admin\desktop\src-client\speedtreelib\SpeedTreeForest.h(35): fatal error C1083: Cannot open include file: 'SpeedTreeRT.h': No such file or directory
1> StdAfx.cpp
5>------ Build started: Project: SphereLib, Configuration: Release Win32 ------
1>c:\users\admin\desktop\src-client\effectlib\../eterLib/StdAfx.h(23): fatal error C1083: Cannot open include file: 'd3d8.h': No such file or directory
5> StdAfx.cpp
5>c:\users\admin\desktop\src-client\spherelib\stdafx.h(7): fatal error C1083: Cannot open include file: 'd3d8.h': No such file or directory
6>------ Build started: Project: eterBase, Configuration: Release Win32 ------
7>------ Build started: Project: eterGrnLib, Configuration: Release Win32 ------
6> cipher.cpp
7> StdAfx.cpp
7>c:\users\admin\desktop\src-client\etergrnlib\stdafx.h(6): fatal error C1083: Cannot open include file: 'granny.h': No such file or directory
8>------ Build started: Project: eterImageLib, Configuration: Release Win32 ------
6>c:\users\admin\desktop\src-client\eterbase\cipher.h(8): fatal error C1083: Cannot open include file: 'cryptopp/cryptlib.h': No such file or directory
6> lzo.cpp
6>lzo.cpp(3): fatal error C1083: Cannot open include file: 'lzo-2.03/lzoLibLink.h': No such file or directory
6> MappedFile.cpp
6>c:\users\admin\desktop\src-client\eterbase\lzo.h(5): fatal error C1083: Cannot open include file: 'lzo-2.03/lzo1x.h': No such file or directory
8> DXTCImage.cpp
8>c:\users\admin\desktop\src-client\eterimagelib\StdAfx.h(33): warning C4996: '_vsnprintf': This function or variable may be unsafe. Consider using _vsnprintf_s instead. To disable deprecation, use _CRT_SECURE_NO_WARNINGS. See online help for details.
8> C:\Program Files (x86)\Microsoft Visual Studio 12.0\VC\include\stdio.h(346) : see declaration of '_vsnprintf'
8>c:\users\admin\desktop\src-client\eterbase\lzo.h(5): fatal error C1083: Cannot open include file: 'lzo-2.03/lzo1x.h': No such file or directory
8> TGAImage.cpp
6> Generating Code...
8>c:\users\admin\desktop\src-client\eterimagelib\StdAfx.h(33): warning C4996: '_vsnprintf': This function or variable may be unsafe. Consider using _vsnprintf_s instead. To disable deprecation, use _CRT_SECURE_NO_WARNINGS. See online help for details.
8> C:\Program Files (x86)\Microsoft Visual Studio 12.0\VC\include\stdio.h(346) : see declaration of '_vsnprintf'
8>c:\users\admin\desktop\src-client\eterbase\lzo.h(5): fatal error C1083: Cannot open include file: 'lzo-2.03/lzo1x.h': No such file or directory
8> Generating Code...
9>------ Build started: Project: eterPythonLib, Configuration: Release Win32 ------
10>------ Build started: Project: eterlib, Configuration: Release Win32 ------
9> StdAfx.cpp
9>c:\users\admin\desktop\src-client\eterpythonlib\../EterLib/StdAfx.h(23): fatal error C1083: Cannot open include file: 'd3d8.h': No such file or directory
11>------ Build started: Project: gamelib, Configuration: Release Win32 ------
10> StdAfx.cpp
10>c:\users\admin\desktop\src-client\eterlib\stdafx.h(23): fatal error C1083: Cannot open include file: 'd3d8.h': No such file or directory
12>------ Build started: Project: mileslib, Configuration: Release Win32 ------
11> StdAfx.cpp
12> Stdafx.cpp
12>c:\users\admin\desktop\src-client\mileslib\stdafx.h(12): fatal error C1083: Cannot open include file: 'mss.h': No such file or directory
11>c:\users\admin\desktop\src-client\gamelib\../eterLib/StdAfx.h(23): fatal error C1083: Cannot open include file: 'd3d8.h': No such file or directory
13>------ Build started: Project: scriptLib, Configuration: Release Win32 ------
13> StdAfx.cpp
13>c:\users\admin\desktop\src-client\scriptlib\../eterLib/StdAfx.h(23): fatal error C1083: Cannot open include file: 'd3d8.h': No such file or directory
14>------ Build started: Project: UserInterface, Configuration: Release Win32 ------
14> StdAfx.cpp
14>c:\users\admin\desktop\src-client\userinterface\../eterLib/StdAfx.h(23): fatal error C1083: Cannot open include file: 'd3d8.h': No such file or directory
========== Build: 0 succeeded, 14 failed, 2 up-to-date, 0 skipped ==========Poză:-
*Detalii suplimentare:Fisierele le am deja acolo nu mi le citeste. Ceva detali:-? Am cautat si nimic... Folosesc VS 2013
p.s nu posta daca faci asta doar pt +1 etc.
Fisierele sunt puse acolo (verificate)
Sunt incepator la compilarea surselor , deci sursa s-ar putea sa nu fie buna.
Daca aveti ideei va rog sa`mi spuneti nu vreau sa aud "Ah nobule trebuie sa bagi in eterlib fisieru StdAfx.h de la alta sursa! "
Am facut deja asta si nu a mers.






