Eroare compilare libthecore

Totalitatea subiectelor care nu respectă regulamentul impus in sectiunea "Probleme şi Întrebări" vor fi stocate aici.
Închis
Avatar utilizator
Davis856
Nivel 1

Nivel 1
Mesaje: 50
Membru din: 27 Dec 2014, 16:48
Aprecieri: 155  
Mulţumiri: 0
Medalii

*Problemă:Nu pot sa compilez libthecore.
Tipologie server:PvM
*Resursă folosită:-
*ServerFiles utilizat:propriu
*Syserr:
In function 'void buffer_write(buffer*&, const void*, int)':
buffer.c:165: error: 'MIN' was not declared in this scope
gmake[1]: *** [buffer.o] Error 1
gmake[1]: *** Waiting for unfinished jobs....
gmake[1]: Leaving directory `/usr/src/Sursa/Srcs/Server/libthecore/src'
gmake: *** [default] Error 2

Poză:
*Detalii suplimentare:Am toate lib-urile din ce stiu, nu stiu unde sa pun acel MIN care nu este declarat.
Avatar utilizator
Davis856
Nivel 1

Nivel 1
Mesaje: 50
Membru din: 27 Dec 2014, 16:48
Aprecieri: 155  
Mulţumiri: 0
Medalii

rezolvat. t/c
Închis
Răspunsuri
1
Vizualizări
156
Răspunsuri
5
Vizualizări
225
Răspunsuri
4
Vizualizări
305
Răspunsuri
2
Vizualizări
397

Înapoi la “Arhivă Probleme şi Întrebări”

  • Informaţie