1>------ Build started: Project: EterLocale, Configuration: Lib Win32 ------
1>LINK : fatal error LNK1561: entry point must be defined
2>------ Build started: Project: CWebBrowser, Configuration: Lib Win32 ------
2>LINK : fatal error LNK1561: entry point must be defined
3>------ Build started: Project: EffectLib, Configuration: Lib Win32 ------
3>LINK : fatal error LNK1104: cannot open file 'libci.lib'
4>------ Build started: Project: EterBase, Configuration: Lib Win32 ------
4> Base.cpp
4>..\..\source\EterBase\Poly\Base.cpp(1): fatal error C1083: Cannot open include file: 'StdAfx.h': No such file or directory
4> Poly.cpp
4>..\..\source\EterBase\Poly\Poly.cpp(1): fatal error C1083: Cannot open include file: 'StdAfx.h': No such file or directory
4> Symbol.cpp
4>..\..\source\EterBase\Poly\Symbol.cpp(1): fatal error C1083: Cannot open include file: 'StdAfx.h': No such file or directory
4> SymTable.cpp
4>..\..\source\EterBase\Poly\SymTable.cpp(1): fatal error C1083: Cannot open include file: 'StdAfx.h': No such file or directory
4> Generating Code...
5>------ Build started: Project: EterGrnLib, Configuration: Lib Win32 ------
5>LINK : fatal error LNK1561: entry point must be defined
6>------ Build started: Project: EterImageLib, Configuration: Lib Win32 ------
6>LINK : fatal error LNK1561: entry point must be defined
7>------ Build started: Project: EterPack, Configuration: Lib Win32 ------
7>LINK : fatal error LNK1104: cannot open file 'cryptopp.lib'
8>------ Build started: Project: EterPythonLib, Configuration: Lib Win32 ------
8>LINK : fatal error LNK1561: entry point must be defined
9>------ Build started: Project: EterLib, Configuration: Lib Win32 ------
9>LINK : fatal error LNK1104: cannot open file 'libjpeg-6bMD.lib'
10>------ Build started: Project: GameLib, Configuration: Lib Win32 ------
10>LINK : fatal error LNK1104: cannot open file 'libci.lib'
11>------ Build started: Project: MilesLib, Configuration: Lib Win32 ------
11>LINK : fatal error LNK1561: entry point must be defined
12>------ Build started: Project: PRTerrainLib, Configuration: Lib Win32 ------
12>LINK : fatal error LNK1104: cannot open file 'libci.lib'
13>------ Build started: Project: ScriptLib, Configuration: Lib Win32 ------
13>LINK : fatal error LNK1561: entry point must be defined
14>------ Build started: Project: SpeedTreeLib, Configuration: Lib Win32 ------
14>LINK : fatal error LNK1561: entry point must be defined
15>------ Build started: Project: SphereLib, Configuration: Lib Win32 ------
15>LINK : fatal error LNK1561: entry point must be defined
16>------ Build started: Project: UserInterface, Configuration: Lib Win32 ------
16>m2protect.lib(antilalaker.obj) : error LNK2038: mismatch detected for 'RuntimeLibrary': value 'MT_StaticRelease' doesn't match value 'MD_DynamicRelease' in AccountConnector.obj
16>LINK : fatal error LNK1104: cannot open file 'cryptopp.lib'
========== Build: 0 succeeded, 16 failed, 0 up-to-date, 0 skipped ==========