char.cpp: In member function 'virtual void CHARACTER::EncodeInsertPacket(LPENTITY)':
char.cpp

25: error: incompatible types in assignment of 'int' to 'DWORD [6] {aka unsigned int [6]}'
addPacket.adwShining = 0;
^
char.cpp: In member function 'void CHARACTER::UpdatePacket()':
char.cpp

7: error: 'TPacketGCCharacterUpdate' has no member named 'adwShining'
pack.adwShining[CHR_SHINING_WEAPON_1] = GetWear(WEAR_SHINING_WEAPON_1) ? GetWear(WEAR_SHINING_WEAPON_1)->GetVnum() : 0;
^
char.cpp

7: error: 'TPacketGCCharacterUpdate' has no member named 'adwShining'
pack.adwShining[CHR_SHINING_WEAPON_2] = GetWear(WEAR_SHINING_WEAPON_2) ? GetWear(WEAR_SHINING_WEAPON_2)->GetVnum() : 0;
^
char.cpp

7: error: 'TPacketGCCharacterUpdate' has no member named 'adwShining'
pack.adwShining[CHR_SHINING_WEAPON_3] = GetWear(WEAR_SHINING_WEAPON_3) ? GetWear(WEAR_SHINING_WEAPON_3)->GetVnum() : 0;
^
char.cpp

7: error: 'TPacketGCCharacterUpdate' has no member named 'adwShining'
pack.adwShining[CHR_SHINING_ARMOR_1] = GetWear(WEAR_SHINING_ARMOR_1) ? GetWear(WEAR_SHINING_ARMOR_1)->GetVnum() : 0;
^
char.cpp

7: error: 'TPacketGCCharacterUpdate' has no member named 'adwShining'
pack.adwShining[CHR_SHINING_ARMOR_2] = GetWear(WEAR_SHINING_ARMOR_2) ? GetWear(WEAR_SHINING_ARMOR_2)->GetVnum() : 0;
^
char.cpp

7: error: 'TPacketGCCharacterUpdate' has no member named 'adwShining'
pack.adwShining[CHR_SHINING_SPECIAL] = GetWear(WEAR_SHINING_SPECIAL) ? GetWear(WEAR_SHINING_SPECIAL)->GetVnum() : 0;
^
gmake: *** [.obj/char.o] Error 1
gmake: *** Waiting for unfinished jobs....