Tipologie server: PVM
*Resursă folosită: offline shop by great sursa/offline-shop-great-fix-cumparare-t77358.html
*ServerFiles utilizat: goanga
*Detalii suplimentare: La compilarea sursei game primesc o gramada de erori, sincer m-am pierdut in ele ...
Cod: Selectaţi tot
In file included from ani.cpp:11:
char.h:2080: error: expected unqualified-id before 'public'
char.h: In function 'void SetPrivShop(DWORD)':
char.h:2084: error: 'bprivShop' was not declared in this scope
char.h: At global scope:
char.h:2085: error: non-member function 'BOOL IsPrivShop()' cannot have cv-qualifier
char.h: In function 'BOOL IsPrivShop()':
char.h:2085: error: 'bprivShop' was not declared in this scope
char.h: At global scope:
char.h:2086: error: non-member function 'DWORD GetPrivShop()' cannot have cv-qualifier
char.h: In function 'DWORD GetPrivShop()':
char.h:2086: error: 'bprivShop' was not declared in this scope
char.h: In function 'void SetPrivShopOwner(DWORD)':
char.h:2087: error: 'bprivShopOwner' was not declared in this scope
char.h: At global scope:
char.h:2088: error: non-member function 'DWORD GetPrivShopOwner()' cannot have cv-qualifier
char.h: In function 'DWORD GetPrivShopOwner()':
char.h:2088: error: 'bprivShopOwner' was not declared in this scope
char.h: At global scope:
char.h:2090: error: non-member function 'DWORD GetShopTime()' cannot have cv-qualifier
char.h: In function 'DWORD GetShopTime()':
char.h:2090: error: 'dw_ShopTime' was not declared in this scope
char.h: In function 'void SetShopTime(DWORD)':
char.h:2091: error: 'dw_ShopTime' was not declared in this scope
char.h: At global scope:
char.h:2099: error: expected unqualified-id before 'private'
char.h:2104: error: expected unqualified-id before 'public'
char.h:2106: error: expected unqualified-id before 'protected'
char.h:2111: error: expected unqualified-id before 'protected'
char.h:2117: error: expected unqualified-id before 'public'
compile building.cpp
gmake: *** [obj/ani.o] Error 1
gmake: *** Waiting for unfinished jobs....
In file included from arena.cpp:9:
char.h:2080: error: expected unqualified-id before 'public'
char.h: In function 'void SetPrivShop(DWORD)':
char.h:2084: error: 'bprivShop' was not declared in this scope
char.h: At global scope:
char.h:2085: error: non-member function 'BOOL IsPrivShop()' cannot have cv-qualifier
char.h: In function 'BOOL IsPrivShop()':
char.h:2085: error: 'bprivShop' was not declared in this scope
char.h: At global scope:
char.h:2086: error: non-member function 'DWORD GetPrivShop()' cannot have cv-qualifier
char.h: In function 'DWORD GetPrivShop()':
char.h:2086: error: 'bprivShop' was not declared in this scope
char.h: In function 'void SetPrivShopOwner(DWORD)':
char.h:2087: error: 'bprivShopOwner' was not declared in this scope
char.h: At global scope:
char.h:2088: error: non-member function 'DWORD GetPrivShopOwner()' cannot have cv-qualifier
char.h: In function 'DWORD GetPrivShopOwner()':
char.h:2088: error: 'bprivShopOwner' was not declared in this scope
char.h: At global scope:
char.h:2090: error: non-member function 'DWORD GetShopTime()' cannot have cv-qualifier
char.h: In function 'DWORD GetShopTime()':
char.h:2090: error: 'dw_ShopTime' was not declared in this scope
char.h: In function 'void SetShopTime(DWORD)':
char.h:2091: error: 'dw_ShopTime' was not declared in this scope
char.h: At global scope:
char.h:2099: error: expected unqualified-id before 'private'
char.h:2104: error: expected unqualified-id before 'public'
char.h:2106: error: expected unqualified-id before 'protected'
char.h:2111: error: expected unqualified-id before 'protected'
char.h:2117: error: expected unqualified-id before 'public'
In file included from BattleArena.cpp:6:
char.h:2080: error: expected unqualified-id before 'public'
char.h: In function 'void SetPrivShop(DWORD)':
char.h:2084: error: 'bprivShop' was not declared in this scope
char.h: At global scope:
char.h:2085: error: non-member function 'BOOL IsPrivShop()' cannot have cv-qualifier
char.h: In function 'BOOL IsPrivShop()':
char.h:2085: error: 'bprivShop' was not declared in this scope
char.h: At global scope:
char.h:2086: error: non-member function 'DWORD GetPrivShop()' cannot have cv-qualifier
char.h: In function 'DWORD GetPrivShop()':
char.h:2086: error: 'bprivShop' was not declared in this scope
char.h: In function 'void SetPrivShopOwner(DWORD)':
char.h:2087: error: 'bprivShopOwner' was not declared in this scope
char.h: At global scope:
char.h:2088: error: non-member function 'DWORD GetPrivShopOwner()' cannot have cv-qualifier
char.h: In function 'DWORD GetPrivShopOwner()':
char.h:2088: error: 'bprivShopOwner' was not declared in this scope
char.h: At global scope:
char.h:2090: error: non-member function 'DWORD GetShopTime()' cannot have cv-qualifier
char.h: In function 'DWORD GetShopTime()':
char.h:2090: error: 'dw_ShopTime' was not declared in this scope
char.h: In function 'void SetShopTime(DWORD)':
char.h:2091: error: 'dw_ShopTime' was not declared in this scope
char.h: At global scope:
char.h:2099: error: expected unqualified-id before 'private'
char.h:2104: error: expected unqualified-id before 'public'
char.h:2106: error: expected unqualified-id before 'protected'
char.h:2111: error: expected unqualified-id before 'protected'
char.h:2117: error: expected unqualified-id before 'public'
In file included from OXEvent.cpp:9:
char.h:2080: error: expected unqualified-id before 'public'
char.h: In function 'void SetPrivShop(DWORD)':
char.h:2084: error: 'bprivShop' was not declared in this scope
char.h: At global scope:
char.h:2085: error: non-member function 'BOOL IsPrivShop()' cannot have cv-qualifier
char.h: In function 'BOOL IsPrivShop()':
char.h:2085: error: 'bprivShop' was not declared in this scope
char.h: At global scope:
char.h:2086: error: non-member function 'DWORD GetPrivShop()' cannot have cv-qualifier
char.h: In function 'DWORD GetPrivShop()':
char.h:2086: error: 'bprivShop' was not declared in this scope
char.h: In function 'void SetPrivShopOwner(DWORD)':
char.h:2087: error: 'bprivShopOwner' was not declared in this scope
char.h: At global scope:
char.h:2088: error: non-member function 'DWORD GetPrivShopOwner()' cannot have cv-qualifier
char.h: In function 'DWORD GetPrivShopOwner()':
char.h:2088: error: 'bprivShopOwner' was not declared in this scope
char.h: At global scope:
char.h:2090: error: non-member function 'DWORD GetShopTime()' cannot have cv-qualifier
char.h: In function 'DWORD GetShopTime()':
char.h:2090: error: 'dw_ShopTime' was not declared in this scope
char.h: In function 'void SetShopTime(DWORD)':
char.h:2091: error: 'dw_ShopTime' was not declared in this scope
char.h: At global scope:
char.h:2099: error: expected unqualified-id before 'private'
char.h:2104: error: expected unqualified-id before 'public'
char.h:2106: error: expected unqualified-id before 'protected'
char.h:2111: error: expected unqualified-id before 'protected'
char.h:2117: error: expected unqualified-id before 'public'
gmake: *** [obj/arena.o] Error 1
In file included from battle.cpp:5:
char.h:2080: error: expected unqualified-id before 'public'
char.h: In function 'void SetPrivShop(DWORD)':
char.h:2084: error: 'bprivShop' was not declared in this scope
char.h: At global scope:
char.h:2085: error: non-member function 'BOOL IsPrivShop()' cannot have cv-qualifier
char.h: In function 'BOOL IsPrivShop()':
char.h:2085: error: 'bprivShop' was not declared in this scope
char.h: At global scope:
char.h:2086: error: non-member function 'DWORD GetPrivShop()' cannot have cv-qualifier
char.h: In function 'DWORD GetPrivShop()':
char.h:2086: error: 'bprivShop' was not declared in this scope
char.h: In function 'void SetPrivShopOwner(DWORD)':
char.h:2087: error: 'bprivShopOwner' was not declared in this scope
char.h: At global scope:
char.h:2088: error: non-member function 'DWORD GetPrivShopOwner()' cannot have cv-qualifier
char.h: In function 'DWORD GetPrivShopOwner()':
char.h:2088: error: 'bprivShopOwner' was not declared in this scope
char.h: At global scope:
char.h:2090: error: non-member function 'DWORD GetShopTime()' cannot have cv-qualifier
char.h: In function 'DWORD GetShopTime()':
char.h:2090: error: 'dw_ShopTime' was not declared in this scope
char.h: In function 'void SetShopTime(DWORD)':
char.h:2091: error: 'dw_ShopTime' was not declared in this scope
char.h: At global scope:
char.h:2099: error: expected unqualified-id before 'private'
char.h:2104: error: expected unqualified-id before 'public'
char.h:2106: error: expected unqualified-id before 'protected'
char.h:2111: error: expected unqualified-id before 'protected'
char.h:2117: error: expected unqualified-id before 'public'
gmake: *** [obj/BattleArena.o] Error 1
gmake: *** [obj/OXEvent.o] Error 1
gmake: *** [obj/battle.o] Error 1
In file included from building.cpp:8:
char.h:2080: error: expected unqualified-id before 'public'
char.h: In function 'void SetPrivShop(DWORD)':
char.h:2084: error: 'bprivShop' was not declared in this scope
char.h: At global scope:
char.h:2085: error: non-member function 'BOOL IsPrivShop()' cannot have cv-qualifier
char.h: In function 'BOOL IsPrivShop()':
char.h:2085: error: 'bprivShop' was not declared in this scope
char.h: At global scope:
char.h:2086: error: non-member function 'DWORD GetPrivShop()' cannot have cv-qualifier
char.h: In function 'DWORD GetPrivShop()':
char.h:2086: error: 'bprivShop' was not declared in this scope
char.h: In function 'void SetPrivShopOwner(DWORD)':
char.h:2087: error: 'bprivShopOwner' was not declared in this scope
char.h: At global scope:
char.h:2088: error: non-member function 'DWORD GetPrivShopOwner()' cannot have cv-qualifier
char.h: In function 'DWORD GetPrivShopOwner()':
char.h:2088: error: 'bprivShopOwner' was not declared in this scope
char.h: At global scope:
char.h:2090: error: non-member function 'DWORD GetShopTime()' cannot have cv-qualifier
char.h: In function 'DWORD GetShopTime()':
char.h:2090: error: 'dw_ShopTime' was not declared in this scope
char.h: In function 'void SetShopTime(DWORD)':
char.h:2091: error: 'dw_ShopTime' was not declared in this scope
char.h: At global scope:
char.h:2099: error: expected unqualified-id before 'private'
char.h:2104: error: expected unqualified-id before 'public'
char.h:2106: error: expected unqualified-id before 'protected'
char.h:2111: error: expected unqualified-id before 'protected'
char.h:2117: error: expected unqualified-id before 'public'
gmake: *** [obj/building.o] Error 1
Am atasat acestui mesaj si fisierul char.h .
Multumesc anticipat!







